BDBM50148247 CHEMBL3765010
SMILES: [H][C@@]12CC=CC[C@]1([H])C(=NN(C1CCCCCC1)C2=O)c1ccc(OC)c(OCCCCCc2ccccc2)c1
InChI Key: InChIKey=OMBWXFIZADXIQW-URLMMPGGSA-N
Data: 1 IC50
Activity Spreadsheet -- Enzyme Inhibition Constant Data from BindingDB
Found 1 hit for monomerid = 50148247
Trg + Lig
Ki
nM
ΔG°
kcal/mole
IC50
nM
Kd
nM
EC50/IC50
nM
koff
s-1
kon
M-1s-1
pHTemp
°C
Class I phosphodiesterase B1 (TbrPDEB1)
(Trypanosoma brucei)
BDBM50148247
(CHEMBL3765010)
Show SMILES [H][C@@]12CC=CC[C@]1([H])C(=NN(C1CCCCCC1)C2=O)c1ccc(OC)c(OCCCCCc2ccccc2)c1 |r,c:3,9|
Show InChI InChI=1S/C33H42N2O3/c1-37-30-22-21-26(24-31(30)38-23-13-5-8-16-25-14-6-4-7-15-25)32-28-19-11-12-20-29(28)33(36)35(34-32)27-17-9-2-3-10-18-27/h4,6-7,11-12,14-15,21-22,24,27-29H,2-3,5,8-10,13,16-20,23H2,1H3/t28-,29+/m0/s1
n/an/a 63n/an/an/an/an/an/a
Mercachem
Curated by ChEMBL
Assay Description
Inhibition of recombinant Trypanosoma brucei PDEB1 using [3H]-cAMP as substrate after 15 mins by scintillation proximity assay
Bioorg Med Chem 24: 1573-81 (2016)
BindingDB Entry DOI: 10.7270/Q22V2J07