BDBM50148255 CHEMBL3765786
SMILES: [H][C@@]12CC=CC[C@]1([H])C(=NN(C1CCCCCC1)C2=O)c1ccc(OC)c(OCCc2ccc(OC)cc2)c1
InChI Key: InChIKey=ICNQXRPNLGFCCN-RRPNLBNLSA-N
Data: 1 IC50
Activity Spreadsheet -- Enzyme Inhibition Constant Data from BindingDB
Found 1 hit for monomerid = 50148255
Trg + Lig
Ki
nM
ΔG°
kcal/mole
IC50
nM
Kd
nM
EC50/IC50
nM
koff
s-1
kon
M-1s-1
pHTemp
°C
Class I phosphodiesterase B1 (TbrPDEB1)
(Trypanosoma brucei)
BDBM50148255
(CHEMBL3765786)
Show SMILES [H][C@@]12CC=CC[C@]1([H])C(=NN(C1CCCCCC1)C2=O)c1ccc(OC)c(OCCc2ccc(OC)cc2)c1 |r,c:3,9|
Show InChI InChI=1S/C31H38N2O4/c1-35-25-16-13-22(14-17-25)19-20-37-29-21-23(15-18-28(29)36-2)30-26-11-7-8-12-27(26)31(34)33(32-30)24-9-5-3-4-6-10-24/h7-8,13-18,21,24,26-27H,3-6,9-12,19-20H2,1-2H3/t26-,27+/m0/s1
n/an/a 63n/an/an/an/an/an/a
Mercachem
Curated by ChEMBL
Assay Description
Inhibition of recombinant Trypanosoma brucei PDEB1 using [3H]-cAMP as substrate after 15 mins by scintillation proximity assay
Bioorg Med Chem 24: 1573-81 (2016)
BindingDB Entry DOI: 10.7270/Q22V2J07