BDBM50148335 1-Carboxy-3-[2-(carboxymethyl-carbamoyl)-ethanesulfinyl]-propyl-ammonium; chloride::CHEMBL116299
SMILES: [NH3+]C(CCS(=O)CCC(=O)NCC(O)=O)C(O)=O
InChI Key: InChIKey=UXDXOLUBBFNALE-UHFFFAOYSA-O
Data: 1 KI
Activity Spreadsheet -- Enzyme Inhibition Constant Data from BindingDB
Found 1 hit for monomerid = 50148335
Trg + Lig
Ki
nM
ΔG°
kcal/mole
IC50
nM
Kd
nM
EC50/IC50
nM
koff
s-1
kon
M-1s-1
pHTemp
°C
Gamma-glutamyltranspeptidase 1
(Rattus norvegicus)
BDBM50148335
(1-Carboxy-3-[2-(carboxymethyl-carbamoyl)-ethanesul...)
Show SMILES [NH3+]C(CCS(=O)CCC(=O)NCC(O)=O)C(O)=O
Show InChI InChI=1S/C9H16N2O6S/c10-6(9(15)16)1-3-18(17)4-2-7(12)11-5-8(13)14/h6H,1-5,10H2,(H,11,12)(H,13,14)(H,15,16)/p+1
5.30E+4n/an/an/an/an/an/a8.0n/a
Universit£ de Montr£al
Curated by ChEMBL
Assay Description
Compound tested for the inhibition of Gamma-glutamyltranspeptidase in rat kidney at pH 8.0 at 37 degree C (Competitive inhibition)
Bioorg Med Chem Lett 14: 3451-5 (2004)
Article DOI: 10.1016/j.bmcl.2004.04.072
BindingDB Entry DOI: 10.7270/Q2X63NHS