null
SMILES: N(c1n[nH]c2cccnc12)c1ccc2cccnc2c1
InChI Key: InChIKey=DJOZNJRNLBIYQT-UHFFFAOYSA-N
Activity Spreadsheet -- Enzyme Inhibition Constant Data from BindingDB
Found 1 hit for monomerid = 50148375
Trg + Lig
Ki
nM
ΔG°
kcal/mole
IC50
nM
Kd
nM
EC50/IC50
nM
koff
s-1
kon
M-1s-1
pHTemp
°C
Metabotropic glutamate receptor 4
(Homo sapiens (Human))
BDBM50148375
(CHEMBL4800673)
Show SMILES N(c1n[nH]c2cccnc12)c1ccc2cccnc2c1
Show InChI InChI=1S/C21H20N4O3S2/c1-25-12-17(14-4-2-3-13(9-14)11-22)19-16(21(25)26)10-18(29-19)20(23)24-15-5-7-30(27,28)8-6-15/h2-4,9-10,12,15H,5-8H2,1H3,(H2,23,24)
n/an/an/an/a>1.00E+4n/an/an/an/a
TBA
Assay Description
Inhibition of human urine urokinase using L-PyroGlu-Gly-Arg-pNA.HCl substrate at 5 uM
Citation and Details
Article DOI: 10.1016/j.bmcl.2018.10.050
BindingDB Entry DOI: 10.7270/Q2MG7T2H