null
SMILES: [O-][N+](=O)c1c2ccncc2cc2cnc(NCCCN3CCOCC3)nc12
InChI Key: InChIKey=LXOSYHIAUKYCPF-UHFFFAOYSA-N
Activity Spreadsheet -- Enzyme Inhibition Constant Data from BindingDB
Found 1 hit for monomerid = 50148455
Trg + Lig
Ki
nM
ΔG°
kcal/mole
IC50
nM
Kd
nM
EC50/IC50
nM
koff
s-1
kon
M-1s-1
pHTemp
°C
Dual specificity protein kinase CLK1
(Mus musculus)
BDBM50148455
(CHEMBL4791275)
Show SMILES [O-][N+](=O)c1c2ccncc2cc2cnc(NCCCN3CCOCC3)nc12
Show InChI InChI=1S/C23H24F3N3O3S2/c1-13(2)29-12-18(14-4-3-5-15(10-14)23(24,25)26)20-17(22(29)30)11-19(33-20)21(27)28-16-6-8-34(31,32)9-7-16/h3-5,10-13,16H,6-9H2,1-2H3,(H2,27,28)
n/an/a 120n/an/an/an/an/an/a
TBA
Assay Description
Inhibition of human urine urokinase using L-PyroGlu-Gly-Arg-pNA.HCl substrate at 5 uM
Citation and Details