null
SMILES: CN1CCN(CCCNc2ncc3cc4cnccc4c([N+]([O-])=O)c3n2)CC1
InChI Key: InChIKey=KCZMLIMZGLNMQN-UHFFFAOYSA-N
Activity Spreadsheet -- Enzyme Inhibition Constant Data from BindingDB
Found 1 hit for monomerid = 50148456
Trg + Lig
Ki
nM
ΔG°
kcal/mole
IC50
nM
Kd
nM
EC50/IC50
nM
koff
s-1
kon
M-1s-1
pHTemp
°C
Dual specificity protein kinase CLK1
(Mus musculus)
BDBM50148456
(CHEMBL4785650)
Show SMILES CN1CCN(CCCNc2ncc3cc4cnccc4c([N+]([O-])=O)c3n2)CC1
Show InChI InChI=1S/C22H25N3O5S2/c1-25-12-16(13-4-5-17(29-2)18(10-13)30-3)20-15(22(25)26)11-19(31-20)21(23)24-14-6-8-32(27,28)9-7-14/h4-5,10-12,14H,6-9H2,1-3H3,(H2,23,24)
n/an/a 133n/an/an/an/an/an/a
TBA
Assay Description
Inhibition of human urine urokinase using L-PyroGlu-Gly-Arg-pNA.HCl substrate at 5 uM
Citation and Details