null
SMILES: CNc1ncc2cc3cnccc3c([N+]([O-])=O)c2n1
InChI Key: InChIKey=NMMSMXOCHXLFTJ-UHFFFAOYSA-N
PDB links: 1 PDB ID matches this monomer.
Activity Spreadsheet -- Enzyme Inhibition Constant Data from BindingDB
Found 1 hit for monomerid = 50148458
Trg + Lig
Ki
nM
ΔG°
kcal/mole
IC50
nM
Kd
nM
EC50/IC50
nM
koff
s-1
kon
M-1s-1
pHTemp
°C
Dual specificity protein kinase CLK1
(Mus musculus)
BDBM50148458
(CHEMBL4778413)
Show SMILES CNc1ncc2cc3cnccc3c([N+]([O-])=O)c2n1
Show InChI InChI=1S/C18H18N2O4S/c1-19-17(21)15-8-11-16(25-15)12(9-20(2)18(11)22)10-5-6-13(23-3)14(7-10)24-4/h5-9H,1-4H3,(H,19,21)
n/an/a 18n/an/an/an/an/an/a
TBA
Assay Description
Inhibition of human plasmin using pyroGlu-Phe-Lys-pNA.HCl
Citation and Details
3D
3D Structure (crystal)