null
SMILES: C[C@H](Nc1nccc(n1)-n1c(nc2nc(ccc12)N1CCN(C)CC1)-c1ccc(F)cc1)c1ccccc1
InChI Key: InChIKey=XUQRICHQPSQKSS-FQEVSTJZSA-N
Activity Spreadsheet -- Enzyme Inhibition Constant Data from BindingDB
Found 1 hit for monomerid = 50148696
Trg + Lig
Ki
nM
ΔG°
kcal/mole
IC50
nM
Kd
nM
EC50/IC50
nM
koff
s-1
kon
M-1s-1
pHTemp
°C
Mitogen-activated protein kinase 14
(Mus musculus (mouse))
BDBM50148696
(CHEMBL119952 | {4-[(S)-2-(4-Fluoro-phenyl)-5-(4-me...)
Show SMILES C[C@H](Nc1nccc(n1)-n1c(nc2nc(ccc12)N1CCN(C)CC1)-c1ccc(F)cc1)c1ccccc1
Show InChI InChI=1S/C29H29FN8/c1-20(21-6-4-3-5-7-21)32-29-31-15-14-26(34-29)38-24-12-13-25(37-18-16-36(2)17-19-37)33-27(24)35-28(38)22-8-10-23(30)11-9-22/h3-15,20H,16-19H2,1-2H3,(H,31,32,34)/t20-/m0/s1
Reactome pathway
n/an/a 6n/an/an/an/an/an/a
Novartis Institutes for BioMedical Research
Curated by ChEMBL
Assay Description
Inhibition of murine phosphorylated His-Mitogen-activated protein kinase p38 alpha.
Bioorg Med Chem Lett 14: 3595-9 (2004)
Article DOI: 10.1016/j.bmcl.2004.03.106
BindingDB Entry DOI: 10.7270/Q2V69J2C