BDBM50148844 CHEMBL3769543
SMILES: Cl.COc1cc(Cl)c(Cl)cc1C1CC1CN
InChI Key: InChIKey=YHHAEGAFEUZTKY-UHFFFAOYSA-N
Data: 10 EC50
Activity Spreadsheet -- Enzyme Inhibition Constant Data from BindingDB
Found 10 hits for monomerid = 50148844
Trg + Lig
Ki
nM
ΔG°
kcal/mole
IC50
nM
Kd
nM
EC50/IC50
nM
koff
s-1
kon
M-1s-1
pHTemp
°C
5-hydroxytryptamine receptor 2B
(Homo sapiens (Human))
BDBM50148844
(CHEMBL3769543)
Show SMILES Cl.COc1cc(Cl)c(Cl)cc1C1CC1CN
Show InChI InChI=1S/C11H13Cl2NO.ClH/c1-15-11-4-10(13)9(12)3-8(11)7-2-6(7)5-14;/h3-4,6-7H,2,5,14H2,1H3;1H
Reactome pathway
n/an/an/an/a 31n/an/an/an/a
University of Illinois at Chicago
Curated by ChEMBL
Assay Description
Agonist activity at recombinant human 5HT2B receptor expressed in Flp-In-293 cells assessed as calcium flux by FLIPR assay
J Med Chem 59: 578-91 (2016)
BindingDB Entry DOI: 10.7270/Q28C9Z4P
5-hydroxytryptamine receptor 2A
(Homo sapiens (Human))
BDBM50148844
(CHEMBL3769543)
Show SMILES Cl.COc1cc(Cl)c(Cl)cc1C1CC1CN
Show InChI InChI=1S/C11H13Cl2NO.ClH/c1-15-11-4-10(13)9(12)3-8(11)7-2-6(7)5-14;/h3-4,6-7H,2,5,14H2,1H3;1H
Reactome pathway
n/an/an/an/a 84n/an/an/an/a
University of Illinois at Chicago
Curated by ChEMBL
Assay Description
Agonist activity at recombinant human 5HT2A receptor expressed in Flp-In-293 cells assessed as calcium flux by FLIPR assay
J Med Chem 59: 578-91 (2016)
BindingDB Entry DOI: 10.7270/Q28C9Z4P
5-hydroxytryptamine receptor 2A
(Homo sapiens (Human))
BDBM50148844
(CHEMBL3769543)
Show SMILES Cl.COc1cc(Cl)c(Cl)cc1C1CC1CN
Show InChI InChI=1S/C11H13Cl2NO.ClH/c1-15-11-4-10(13)9(12)3-8(11)7-2-6(7)5-14;/h3-4,6-7H,2,5,14H2,1H3;1H
Reactome pathway
n/an/an/an/a 21n/an/an/an/a
University of Illinois at Chicago
Curated by ChEMBL
Assay Description
Agonist activity at recombinant human 5HT2A receptor expressed in Flp-In-293 cells assessed as calcium flux by FLIPR assay
J Med Chem 59: 578-91 (2016)
BindingDB Entry DOI: 10.7270/Q28C9Z4P
5-hydroxytryptamine receptor 2C
(Homo sapiens (Human))
BDBM50148844
(CHEMBL3769543)
Show SMILES Cl.COc1cc(Cl)c(Cl)cc1C1CC1CN
Show InChI InChI=1S/C11H13Cl2NO.ClH/c1-15-11-4-10(13)9(12)3-8(11)7-2-6(7)5-14;/h3-4,6-7H,2,5,14H2,1H3;1H
Reactome pathway
n/an/an/an/a 14n/an/an/an/a
University of Illinois at Chicago
Curated by ChEMBL
Assay Description
Agonist activity at recombinant human 5HT2C-INI receptor expressed in Flp-In-293 cells assessed as calcium flux by FLIPR assay
J Med Chem 59: 578-91 (2016)
BindingDB Entry DOI: 10.7270/Q28C9Z4P
5-hydroxytryptamine receptor 2A
(Homo sapiens (Human))
BDBM50148844
(CHEMBL3769543)
Show SMILES Cl.COc1cc(Cl)c(Cl)cc1C1CC1CN
Show InChI InChI=1S/C11H13Cl2NO.ClH/c1-15-11-4-10(13)9(12)3-8(11)7-2-6(7)5-14;/h3-4,6-7H,2,5,14H2,1H3;1H
Reactome pathway
n/an/an/an/a 21n/an/an/an/a
University of Illinois at Chicago
Curated by ChEMBL
Assay Description
Agonist activity at recombinant human 5HT2A receptor expressed in Flp-In-293 cells assessed as calcium flux by FLIPR assay
J Med Chem 59: 578-91 (2016)
BindingDB Entry DOI: 10.7270/Q28C9Z4P
5-hydroxytryptamine receptor 2C
(Homo sapiens (Human))
BDBM50148844
(CHEMBL3769543)
Show SMILES Cl.COc1cc(Cl)c(Cl)cc1C1CC1CN
Show InChI InChI=1S/C11H13Cl2NO.ClH/c1-15-11-4-10(13)9(12)3-8(11)7-2-6(7)5-14;/h3-4,6-7H,2,5,14H2,1H3;1H
Reactome pathway
n/an/an/an/a 13n/an/an/an/a
University of Illinois at Chicago
Curated by ChEMBL
Assay Description
Agonist activity at recombinant human 5HT2C-INI receptor expressed in Flp-In-293 cells assessed as calcium flux by FLIPR assay
J Med Chem 59: 578-91 (2016)
BindingDB Entry DOI: 10.7270/Q28C9Z4P
5-hydroxytryptamine receptor 2C
(Homo sapiens (Human))
BDBM50148844
(CHEMBL3769543)
Show SMILES Cl.COc1cc(Cl)c(Cl)cc1C1CC1CN
Show InChI InChI=1S/C11H13Cl2NO.ClH/c1-15-11-4-10(13)9(12)3-8(11)7-2-6(7)5-14;/h3-4,6-7H,2,5,14H2,1H3;1H
Reactome pathway
n/an/an/an/a 9.80n/an/an/an/a
University of Illinois at Chicago
Curated by ChEMBL
Assay Description
Agonist activity at recombinant human 5HT2C-INI receptor expressed in Flp-In-293 cells assessed as calcium flux by FLIPR assay
J Med Chem 59: 578-91 (2016)
BindingDB Entry DOI: 10.7270/Q28C9Z4P
5-hydroxytryptamine receptor 2B
(Homo sapiens (Human))
BDBM50148844
(CHEMBL3769543)
Show SMILES Cl.COc1cc(Cl)c(Cl)cc1C1CC1CN
Show InChI InChI=1S/C11H13Cl2NO.ClH/c1-15-11-4-10(13)9(12)3-8(11)7-2-6(7)5-14;/h3-4,6-7H,2,5,14H2,1H3;1H
Reactome pathway
n/an/an/an/a 31n/an/an/an/a
University of Illinois at Chicago
Curated by ChEMBL
Assay Description
Agonist activity at recombinant human 5HT2B receptor expressed in Flp-In-293 cells assessed as calcium flux by FLIPR assay
J Med Chem 59: 578-91 (2016)
BindingDB Entry DOI: 10.7270/Q28C9Z4P
5-hydroxytryptamine receptor 2A
(Homo sapiens (Human))
BDBM50148844
(CHEMBL3769543)
Show SMILES Cl.COc1cc(Cl)c(Cl)cc1C1CC1CN
Show InChI InChI=1S/C11H13Cl2NO.ClH/c1-15-11-4-10(13)9(12)3-8(11)7-2-6(7)5-14;/h3-4,6-7H,2,5,14H2,1H3;1H
Reactome pathway
n/an/an/an/a 85n/an/an/an/a
University of Illinois at Chicago
Curated by ChEMBL
Assay Description
Agonist activity at recombinant human 5HT2A receptor expressed in Flp-In-293 cells assessed as calcium flux by FLIPR assay
J Med Chem 59: 578-91 (2016)
BindingDB Entry DOI: 10.7270/Q28C9Z4P
5-hydroxytryptamine receptor 2C
(Homo sapiens (Human))
BDBM50148844
(CHEMBL3769543)
Show SMILES Cl.COc1cc(Cl)c(Cl)cc1C1CC1CN
Show InChI InChI=1S/C11H13Cl2NO.ClH/c1-15-11-4-10(13)9(12)3-8(11)7-2-6(7)5-14;/h3-4,6-7H,2,5,14H2,1H3;1H
Reactome pathway
n/an/an/an/a 9.70n/an/an/an/a
University of Illinois at Chicago
Curated by ChEMBL
Assay Description
Agonist activity at recombinant human 5HT2C-INI receptor expressed in Flp-In-293 cells assessed as calcium flux by FLIPR assay
J Med Chem 59: 578-91 (2016)
BindingDB Entry DOI: 10.7270/Q28C9Z4P