BDBM50149039 Biphenyl-4-carboxylic acid 1-(3-phenyl-propyl)-piperidin-3-ylmethyl ester::CHEMBL122218
SMILES: O=C(OCC1CCCN(CCCc2ccccc2)C1)c1ccc(cc1)-c1ccccc1
InChI Key: InChIKey=GQIUISIPQMWLHH-UHFFFAOYSA-N
Data: 2 IC50
Activity Spreadsheet -- Enzyme Inhibition Constant Data from BindingDB
Found 2 hits for monomerid = 50149039
Trg + Lig
Ki
nM
ΔG°
kcal/mole
IC50
nM
Kd
nM
EC50/IC50
nM
koff
s-1
kon
M-1s-1
pHTemp
°C
Neuronal acetylcholine receptor subunit alpha-4/beta-2
(Homo sapiens (Human))
BDBM50149039
(Biphenyl-4-carboxylic acid 1-(3-phenyl-propyl)-pip...)
Show SMILES O=C(OCC1CCCN(CCCc2ccccc2)C1)c1ccc(cc1)-c1ccccc1
Show InChI InChI=1S/C28H31NO2/c30-28(27-17-15-26(16-18-27)25-13-5-2-6-14-25)31-22-24-12-8-20-29(21-24)19-7-11-23-9-3-1-4-10-23/h1-6,9-10,13-18,24H,7-8,11-12,19-22H2
NCI pathway
Reactome pathway
n/an/a 6.31E+3n/an/an/an/an/an/a
The Ohio State University
Curated by ChEMBL
Assay Description
Antagonist activity at human nAChR alpha4/beta2 receptor expressed in HEK ts201 cells assessed as calcium accumulation by fluorescence analysis
Bioorg Med Chem Lett 22: 1797-813 (2012)
Article DOI: 10.1016/j.bmcl.2011.11.051
BindingDB Entry DOI: 10.7270/Q22Z16S2
Neuronal acetylcholine receptor subunit alpha-3/beta-4
(Homo sapiens (Human))
BDBM50149039
(Biphenyl-4-carboxylic acid 1-(3-phenyl-propyl)-pip...)
Show SMILES O=C(OCC1CCCN(CCCc2ccccc2)C1)c1ccc(cc1)-c1ccccc1
Show InChI InChI=1S/C28H31NO2/c30-28(27-17-15-26(16-18-27)25-13-5-2-6-14-25)31-22-24-12-8-20-29(21-24)19-7-11-23-9-3-1-4-10-23/h1-6,9-10,13-18,24H,7-8,11-12,19-22H2
n/an/a 3.00E+3n/an/an/an/an/an/a
Ohio University
Curated by ChEMBL
Assay Description
Effect on alpha3-beta4 neuronal nicotinic acetylcholine receptor-stimulated adrenal catecholamine secretion
Bioorg Med Chem Lett 14: 3739-42 (2004)
Article DOI: 10.1016/j.bmcl.2004.05.001
BindingDB Entry DOI: 10.7270/Q28G8M80