null
SMILES: COc1ccccc1C(=O)OCC1CCCN(CCCc2ccccc2)C1
InChI Key: InChIKey=KBNPAUMJJDMVAX-UHFFFAOYSA-N
Activity Spreadsheet -- Enzyme Inhibition Constant Data from BindingDB
Found 2 hits for monomerid = 50149050
Trg + Lig
Ki
nM
ΔG°
kcal/mole
IC50
nM
Kd
nM
EC50/IC50
nM
koff
s-1
kon
M-1s-1
pHTemp
°C
Neuronal acetylcholine receptor subunit alpha-4/beta-2
(Homo sapiens (Human))
BDBM50149050
(2-Methoxy-benzoic acid 1-(3-phenyl-propyl)-piperid...)
Show SMILES COc1ccccc1C(=O)OCC1CCCN(CCCc2ccccc2)C1
Show InChI InChI=1S/C23H29NO3/c1-26-22-14-6-5-13-21(22)23(25)27-18-20-12-8-16-24(17-20)15-7-11-19-9-3-2-4-10-19/h2-6,9-10,13-14,20H,7-8,11-12,15-18H2,1H3
NCI pathway
Reactome pathway
n/an/a 7.94E+3n/an/an/an/an/an/a
The Ohio State University
Curated by ChEMBL
Assay Description
Antagonist activity at human nAChR alpha4/beta2 receptor expressed in HEK ts201 cells assessed as calcium accumulation by fluorescence analysis
Bioorg Med Chem Lett 22: 1797-813 (2012)
Article DOI: 10.1016/j.bmcl.2011.11.051
BindingDB Entry DOI: 10.7270/Q22Z16S2
Neuronal acetylcholine receptor subunit alpha-3/beta-4
(Homo sapiens (Human))
BDBM50149050
(2-Methoxy-benzoic acid 1-(3-phenyl-propyl)-piperid...)
Show SMILES COc1ccccc1C(=O)OCC1CCCN(CCCc2ccccc2)C1
Show InChI InChI=1S/C23H29NO3/c1-26-22-14-6-5-13-21(22)23(25)27-18-20-12-8-16-24(17-20)15-7-11-19-9-3-2-4-10-19/h2-6,9-10,13-14,20H,7-8,11-12,15-18H2,1H3
n/an/a 3.20E+3n/an/an/an/an/an/a
Ohio University
Curated by ChEMBL
Assay Description
Effect on alpha3-beta4 neuronal nicotinic acetylcholine receptor-stimulated adrenal catecholamine secretion
Bioorg Med Chem Lett 14: 3739-42 (2004)
Article DOI: 10.1016/j.bmcl.2004.05.001
BindingDB Entry DOI: 10.7270/Q28G8M80