BDBM50149146 (S)-3-(Benzo[b]thiophen-2-ylmethoxy)-1-aza-bicyclo[2.2.2]octane::CHEMBL125069
SMILES: C(O[C@@H]1CN2CCC1CC2)c1cc2ccccc2s1
InChI Key: InChIKey=GFYPTKLMKVKMDV-OAHLLOKOSA-N
Data: 2 KI  1 IC50
Activity Spreadsheet -- Enzyme Inhibition Constant Data from BindingDB
Found 3 hits for monomerid = 50149146
Trg + Lig
Ki
nM
ΔG°
kcal/mole
IC50
nM
Kd
nM
EC50/IC50
nM
koff
s-1
kon
M-1s-1
pHTemp
°C
Neuronal acetylcholine receptor protein alpha-7 subunit
(Homo sapiens (Human))
BDBM50149146
((S)-3-(Benzo[b]thiophen-2-ylmethoxy)-1-aza-bicyclo...)
Show SMILES C(O[C@@H]1CN2CCC1CC2)c1cc2ccccc2s1 |wD:2.1,(.52,2.64,;-.81,3.43,;-2.15,2.66,;-2.15,1.11,;-3.48,.34,;-3.04,1.54,;-4.11,2.26,;-3.48,3.43,;-4.81,2.66,;-4.81,1.11,;1.86,3.41,;3.26,2.78,;4.29,3.92,;5.83,3.9,;6.62,5.24,;5.85,6.59,;4.31,6.59,;3.53,5.26,;2.02,4.95,)|
Show InChI InChI=1S/C16H19NOS/c1-2-4-16-13(3-1)9-14(19-16)11-18-15-10-17-7-5-12(15)6-8-17/h1-4,9,12,15H,5-8,10-11H2/t15-/m1/s1
13n/an/an/an/an/an/an/an/a
Targacept, Inc
Curated by ChEMBL
Assay Description
Binding affinity to alpha7 nAChR
J Med Chem 54: 7943-61 (2011)
Article DOI: 10.1021/jm2007672
BindingDB Entry DOI: 10.7270/Q29P32QP
Neuronal acetylcholine receptor
(Rattus norvegicus (Rat))
BDBM50149146
((S)-3-(Benzo[b]thiophen-2-ylmethoxy)-1-aza-bicyclo...)
Show SMILES C(O[C@@H]1CN2CCC1CC2)c1cc2ccccc2s1 |wD:2.1,(.52,2.64,;-.81,3.43,;-2.15,2.66,;-2.15,1.11,;-3.48,.34,;-3.04,1.54,;-4.11,2.26,;-3.48,3.43,;-4.81,2.66,;-4.81,1.11,;1.86,3.41,;3.26,2.78,;4.29,3.92,;5.83,3.9,;6.62,5.24,;5.85,6.59,;4.31,6.59,;3.53,5.26,;2.02,4.95,)|
Show InChI InChI=1S/C16H19NOS/c1-2-4-16-13(3-1)9-14(19-16)11-18-15-10-17-7-5-12(15)6-8-17/h1-4,9,12,15H,5-8,10-11H2/t15-/m1/s1
Reactome pathway
13n/an/an/an/an/an/an/an/a
Mitsubishi Pharma Corporation
Curated by ChEMBL
Assay Description
Inhibition of [125I]alpha-bungarotoxin binding to rat nicotinic acetylcholine receptor alpha7
J Med Chem 48: 2678-86 (2005)
Article DOI: 10.1021/jm049188d
BindingDB Entry DOI: 10.7270/Q2M0466W
Neuronal acetylcholine receptor
(Rattus norvegicus (Rat))
BDBM50149146
((S)-3-(Benzo[b]thiophen-2-ylmethoxy)-1-aza-bicyclo...)
Show SMILES C(O[C@@H]1CN2CCC1CC2)c1cc2ccccc2s1 |wD:2.1,(.52,2.64,;-.81,3.43,;-2.15,2.66,;-2.15,1.11,;-3.48,.34,;-3.04,1.54,;-4.11,2.26,;-3.48,3.43,;-4.81,2.66,;-4.81,1.11,;1.86,3.41,;3.26,2.78,;4.29,3.92,;5.83,3.9,;6.62,5.24,;5.85,6.59,;4.31,6.59,;3.53,5.26,;2.02,4.95,)|
Show InChI InChI=1S/C16H19NOS/c1-2-4-16-13(3-1)9-14(19-16)11-18-15-10-17-7-5-12(15)6-8-17/h1-4,9,12,15H,5-8,10-11H2/t15-/m1/s1
Reactome pathway
n/an/a 0.0260n/an/an/an/an/an/a
Mitsubishi Pharma Corporation
Curated by ChEMBL
Assay Description
Alpha 7 nicotinic acetylcholine receptor binding activity in PC12 cells
Bioorg Med Chem Lett 14: 3781-4 (2004)
Article DOI: 10.1016/j.bmcl.2004.04.091
BindingDB Entry DOI: 10.7270/Q2X066G1