BDBM50149216 Benzofuran-2-carboxylic acid (2-{4-[benzyl-(2-hydroxycarbamoyl-4,6-dimethyl-phenyl)-sulfamoyl]-phenoxy}-ethyl)-amide::CHEMBL327002::WAY-170523
SMILES: Cc1cc(C)c(N(Cc2ccccc2)S(=O)(=O)c2ccc(OCCNC(=O)c3cc4ccccc4o3)cc2)c(c1)C(=O)NO
InChI Key: InChIKey=FARMEEAGJWMFSZ-UHFFFAOYSA-N
Data: 3 IC50
Activity Spreadsheet -- Enzyme Inhibition Constant Data from BindingDB
Found 3 hits for monomerid = 50149216
Trg + Lig
Ki
nM
ΔG°
kcal/mole
IC50
nM
Kd
nM
EC50/IC50
nM
koff
s-1
kon
M-1s-1
pHTemp
°C
Matrix metalloproteinase 13
(Bos taurus)
BDBM50149216
(Benzofuran-2-carboxylic acid (2-{4-[benzyl-(2-hydr...)
Show SMILES Cc1cc(C)c(N(Cc2ccccc2)S(=O)(=O)c2ccc(OCCNC(=O)c3cc4ccccc4o3)cc2)c(c1)C(=O)NO
Show InChI InChI=1S/C33H31N3O7S/c1-22-18-23(2)31(28(19-22)32(37)35-39)36(21-24-8-4-3-5-9-24)44(40,41)27-14-12-26(13-15-27)42-17-16-34-33(38)30-20-25-10-6-7-11-29(25)43-30/h3-15,18-20,39H,16-17,21H2,1-2H3,(H,34,38)(H,35,37)
n/an/a 1.00E+4n/an/an/an/an/an/a
Wyeth Research
Curated by ChEMBL
Assay Description
Inhibitory concentration against MMP-13 of bovine articular cartilage explants
Bioorg Med Chem Lett 15: 4105-9 (2005)
Article DOI: 10.1016/j.bmcl.2005.06.019
BindingDB Entry DOI: 10.7270/Q2TX3DXK
Collagenase 3
(Homo sapiens (Human))
BDBM50149216
(Benzofuran-2-carboxylic acid (2-{4-[benzyl-(2-hydr...)
Show SMILES Cc1cc(C)c(N(Cc2ccccc2)S(=O)(=O)c2ccc(OCCNC(=O)c3cc4ccccc4o3)cc2)c(c1)C(=O)NO
Show InChI InChI=1S/C33H31N3O7S/c1-22-18-23(2)31(28(19-22)32(37)35-39)36(21-24-8-4-3-5-9-24)44(40,41)27-14-12-26(13-15-27)42-17-16-34-33(38)30-20-25-10-6-7-11-29(25)43-30/h3-15,18-20,39H,16-17,21H2,1-2H3,(H,34,38)(H,35,37)
NCI pathway
Reactome pathway
n/an/a 17n/an/an/an/an/an/a
Sunesis Pharmaceuticals Inc.
Curated by ChEMBL
Assay Description
Inhibition of Matrix Metalloprotease-13 (MMP-13)
J Med Chem 47: 3463-82 (2004)
Article DOI: 10.1021/jm040031v
BindingDB Entry DOI: 10.7270/Q2NC61ZJ
Interstitial collagenase
(Homo sapiens (Human))
BDBM50149216
(Benzofuran-2-carboxylic acid (2-{4-[benzyl-(2-hydr...)
Show SMILES Cc1cc(C)c(N(Cc2ccccc2)S(=O)(=O)c2ccc(OCCNC(=O)c3cc4ccccc4o3)cc2)c(c1)C(=O)NO
Show InChI InChI=1S/C33H31N3O7S/c1-22-18-23(2)31(28(19-22)32(37)35-39)36(21-24-8-4-3-5-9-24)44(40,41)27-14-12-26(13-15-27)42-17-16-34-33(38)30-20-25-10-6-7-11-29(25)43-30/h3-15,18-20,39H,16-17,21H2,1-2H3,(H,34,38)(H,35,37)
Reactome pathway
n/an/a>1.00E+4n/an/an/an/an/an/a
Sunesis Pharmaceuticals Inc.
Curated by ChEMBL
Assay Description
Inhibition of Matrix Metalloprotease-1 (MMP-1)
J Med Chem 47: 3463-82 (2004)
Article DOI: 10.1021/jm040031v
BindingDB Entry DOI: 10.7270/Q2NC61ZJ