BDBM50149572 CHEMBL3771092
SMILES: CC(C)Oc1ccc(cc1Cl)-c1nnc(s1)-c1ccccc1
InChI Key: InChIKey=WPJRYVTWFLCDLL-UHFFFAOYSA-N
Data: 2 EC50
Activity Spreadsheet -- Enzyme Inhibition Constant Data from BindingDB
Found 2 hits for monomerid = 50149572
Trg + Lig
Ki
nM
ΔG°
kcal/mole
IC50
nM
Kd
nM
EC50/IC50
nM
koff
s-1
kon
M-1s-1
pHTemp
°C
Sphingosine 1-phosphate receptor 1
(Homo sapiens (Human))
BDBM50149572
(CHEMBL3771092)
Show SMILES CC(C)Oc1ccc(cc1Cl)-c1nnc(s1)-c1ccccc1
Show InChI InChI=1S/C17H15ClN2OS/c1-11(2)21-15-9-8-13(10-14(15)18)17-20-19-16(22-17)12-6-4-3-5-7-12/h3-11H,1-2H3
Reactome pathway
n/an/an/an/a 251n/an/an/an/a
GlaxoSmithKline
Curated by ChEMBL
Assay Description
Agonist activity at human S1P1 receptor expressed in RH7777 cells by [35S]GTP-gammaS accumulation assay
J Med Chem 59: 1003-20 (2016)
BindingDB Entry DOI: 10.7270/Q2KP842C
Sphingosine 1-phosphate receptor 3
(Homo sapiens (Human))
BDBM50149572
(CHEMBL3771092)
Show SMILES CC(C)Oc1ccc(cc1Cl)-c1nnc(s1)-c1ccccc1
Show InChI InChI=1S/C17H15ClN2OS/c1-11(2)21-15-9-8-13(10-14(15)18)17-20-19-16(22-17)12-6-4-3-5-7-12/h3-11H,1-2H3
NCI pathway
Reactome pathway
n/an/an/an/a 2.00E+4n/an/an/an/a
GlaxoSmithKline
Curated by ChEMBL
Assay Description
Agonist activity at human S1P3 receptor expressed in RBL cells by [35S]GTP-gammaS accumulation assay
J Med Chem 59: 1003-20 (2016)
BindingDB Entry DOI: 10.7270/Q2KP842C