BDBM50149588 CHEMBL3770302
SMILES: CC(C)Oc1ccc(cc1Cl)-c1nnc(s1)-c1cncn1C
InChI Key: InChIKey=XHNWRBJAIUNRCW-UHFFFAOYSA-N
Data: 2 EC50
Activity Spreadsheet -- Enzyme Inhibition Constant Data from BindingDB
Found 2 hits for monomerid = 50149588
Trg + Lig
Ki
nM
ΔG°
kcal/mole
IC50
nM
Kd
nM
EC50/IC50
nM
koff
s-1
kon
M-1s-1
pHTemp
°C
Sphingosine 1-phosphate receptor 3
(Homo sapiens (Human))
BDBM50149588
(CHEMBL3770302)
Show SMILES CC(C)Oc1ccc(cc1Cl)-c1nnc(s1)-c1cncn1C
Show InChI InChI=1S/C15H15ClN4OS/c1-9(2)21-13-5-4-10(6-11(13)16)14-18-19-15(22-14)12-7-17-8-20(12)3/h4-9H,1-3H3
NCI pathway
Reactome pathway
n/an/an/an/a<3.16E+4n/an/an/an/a
GlaxoSmithKline
Curated by ChEMBL
Assay Description
Agonist activity at human S1P3 receptor expressed in RBL cells by [35S]GTP-gammaS accumulation assay
J Med Chem 59: 1003-20 (2016)
BindingDB Entry DOI: 10.7270/Q2KP842C
Sphingosine 1-phosphate receptor 1
(Homo sapiens (Human))
BDBM50149588
(CHEMBL3770302)
Show SMILES CC(C)Oc1ccc(cc1Cl)-c1nnc(s1)-c1cncn1C
Show InChI InChI=1S/C15H15ClN4OS/c1-9(2)21-13-5-4-10(6-11(13)16)14-18-19-15(22-14)12-7-17-8-20(12)3/h4-9H,1-3H3
Reactome pathway
n/an/an/an/a 63n/an/an/an/a
GlaxoSmithKline
Curated by ChEMBL
Assay Description
Agonist activity at human S1P1 receptor expressed in RH7777 cells by [35S]GTP-gammaS accumulation assay
J Med Chem 59: 1003-20 (2016)
BindingDB Entry DOI: 10.7270/Q2KP842C