BDBM50149613 (E)-3-Phenyl-acrylic acid naphthalen-1-yl ester::CHEMBL184839
SMILES: O=C(Oc1cccc2ccccc12)\C=C\c1ccccc1
InChI Key: InChIKey=ILDQBAOOYYSRDQ-BUHFOSPRSA-N
Data: 1 IC50
Activity Spreadsheet -- Enzyme Inhibition Constant Data from BindingDB
Found 1 hit for monomerid = 50149613
Trg + Lig
Ki
nM
ΔG°
kcal/mole
IC50
nM
Kd
nM
EC50/IC50
nM
koff
s-1
kon
M-1s-1
pHTemp
°C
17-beta-hydroxysteroid-dehydrogenase
(Curvularia lunata)
BDBM50149613
((E)-3-Phenyl-acrylic acid naphthalen-1-yl ester | ...)
Show SMILES O=C(Oc1cccc2ccccc12)\C=C\c1ccccc1
Show InChI InChI=1S/C19H14O2/c20-19(14-13-15-7-2-1-3-8-15)21-18-12-6-10-16-9-4-5-11-17(16)18/h1-14H/b14-13+
n/an/a 1.00E+4n/an/an/an/an/an/a
University of Ljubljana
Curated by ChEMBL
Assay Description
Inhibitory activity against 17 beta-hydroxysteroid dehydrogenase catalysed oxidation reaction
Bioorg Med Chem Lett 14: 3933-6 (2004)
Article DOI: 10.1016/j.bmcl.2004.05.069
BindingDB Entry DOI: 10.7270/Q2V40TN6