BDBM50149624 CHEMBL3769631::US10273223, Compound B-92::US9637472, Compound B-92
SMILES: CC(C)n1ncc2c(cc(nc12)N1CCNCC1)C(=O)NCc1c(C)cc(C)[nH]c1=O
InChI Key: InChIKey=FWBKNNLCVUAXME-UHFFFAOYSA-N
Data: 3 IC50
Activity Spreadsheet -- Enzyme Inhibition Constant Data from BindingDB
Found 3 hits for monomerid = 50149624
Trg + Lig
Ki
nM
ΔG°
kcal/mole
IC50
nM
Kd
nM
EC50/IC50
nM
koff
s-1
kon
M-1s-1
pHTemp
°C
Histone-lysine N-methyltransferase EZH2
(Homo sapiens (Human))
BDBM50149624
(CHEMBL3769631 | US10273223, Compound B-92 | US9637...)
Show SMILES CC(C)n1ncc2c(cc(nc12)N1CCNCC1)C(=O)NCc1c(C)cc(C)[nH]c1=O
Show InChI InChI=1S/C22H29N7O2/c1-13(2)29-20-18(12-25-29)16(10-19(27-20)28-7-5-23-6-8-28)21(30)24-11-17-14(3)9-15(4)26-22(17)31/h9-10,12-13,23H,5-8,11H2,1-4H3,(H,24,30)(H,26,31)
n/an/a 1.60E+3n/an/an/an/an/an/a
Epizyme
Curated by ChEMBL
Assay Description
Inhibition of methyltransferase activity of human EZH2 using chicken oligonucleotide as substrate by pull down assay
J Med Chem 59: 1556-64 (2016)
BindingDB Entry DOI: 10.7270/Q2B56MM7
Histone-lysine N-methyltransferase EZH2
(Homo sapiens (Human))
BDBM50149624
(CHEMBL3769631 | US10273223, Compound B-92 | US9637...)
Show SMILES CC(C)n1ncc2c(cc(nc12)N1CCNCC1)C(=O)NCc1c(C)cc(C)[nH]c1=O
Show InChI InChI=1S/C22H29N7O2/c1-13(2)29-20-18(12-25-29)16(10-19(27-20)28-7-5-23-6-8-28)21(30)24-11-17-14(3)9-15(4)26-22(17)31/h9-10,12-13,23H,5-8,11H2,1-4H3,(H,24,30)(H,26,31)
US Patent
n/an/a 2.00E+3n/an/an/an/an/an/a
IRBM/Merck
Assay Description
eneral Procedure for Wild-Type PRC2 Enzyme Assay on Oligonucleosome Substrate. The assays was performed in a buffer consisting of 20 mM bicine (pH=7....
J Med Chem 51: 2350-3 (2008)
BindingDB Entry DOI: 10.7270/Q28P62V9
Histone-lysine N-methyltransferase EZH2
(Homo sapiens (Human))
BDBM50149624
(CHEMBL3769631 | US10273223, Compound B-92 | US9637...)
Show SMILES CC(C)n1ncc2c(cc(nc12)N1CCNCC1)C(=O)NCc1c(C)cc(C)[nH]c1=O
Show InChI InChI=1S/C22H29N7O2/c1-13(2)29-20-18(12-25-29)16(10-19(27-20)28-7-5-23-6-8-28)21(30)24-11-17-14(3)9-15(4)26-22(17)31/h9-10,12-13,23H,5-8,11H2,1-4H3,(H,24,30)(H,26,31)
US Patent
n/an/a 2.00E+3n/an/an/an/an/an/a
Epizyme, Inc.
US Patent
Assay Description
Recombinant PRC2 Enzymes. Human PRC2 enzymes were purified as 4-component enzyme complexes co-expressed in Spodoptera frugiperda (sf9) cells using a ...
US Patent US9637472 (2017)
BindingDB Entry DOI: 10.7270/Q2X0693B