null
SMILES: Brc1cc(Br)cc(CNCCCNc2nc3ncccc3[nH]2)c1
InChI Key: InChIKey=OATZFWWSGWAIMX-UHFFFAOYSA-N
Activity Spreadsheet -- Enzyme Inhibition Constant Data from BindingDB
Found 1 hit for monomerid = 50149630
Trg + Lig
Ki
nM
ΔG°
kcal/mole
IC50
nM
Kd
nM
EC50/IC50
nM
koff
s-1
kon
M-1s-1
pHTemp
°C
Methionine--tRNA ligase
(Staphylococcus aureus (strain MW2))
BDBM50149630
(CHEMBL182960 | N-(3,5-Dibromo-benzyl)-N''-(1H-imid...)
Show SMILES Brc1cc(Br)cc(CNCCCNc2nc3ncccc3[nH]2)c1
Show InChI InChI=1S/C16H17Br2N5/c17-12-7-11(8-13(18)9-12)10-19-4-2-6-21-16-22-14-3-1-5-20-15(14)23-16/h1,3,5,7-9,19H,2,4,6,10H2,(H2,20,21,22,23)
n/an/a 5n/an/an/an/an/an/a
GlaxoSmithKline
Curated by ChEMBL
Assay Description
Inhibitory concentration against Staphylococcus aureus methionyl tRNA synthetase
Bioorg Med Chem Lett 14: 3937-41 (2004)
Article DOI: 10.1016/j.bmcl.2004.05.070
BindingDB Entry DOI: 10.7270/Q2QC02Z9