null
SMILES: CCOc1c(Br)cc(OC)cc1CNCCCNc1nc2ccccc2[nH]1
InChI Key: InChIKey=IJQKHAWQHJYRRF-UHFFFAOYSA-N
Activity Spreadsheet -- Enzyme Inhibition Constant Data from BindingDB
Found 1 hit for monomerid = 50149632
Trg + Lig
Ki
nM
ΔG°
kcal/mole
IC50
nM
Kd
nM
EC50/IC50
nM
koff
s-1
kon
M-1s-1
pHTemp
°C
Methionine--tRNA ligase
(Staphylococcus aureus (strain MW2))
BDBM50149632
(CHEMBL185486 | N-(1H-Benzoimidazol-2-yl)-N''-(3-br...)
Show SMILES CCOc1c(Br)cc(OC)cc1CNCCCNc1nc2ccccc2[nH]1
Show InChI InChI=1S/C20H25BrN4O2/c1-3-27-19-14(11-15(26-2)12-16(19)21)13-22-9-6-10-23-20-24-17-7-4-5-8-18(17)25-20/h4-5,7-8,11-12,22H,3,6,9-10,13H2,1-2H3,(H2,23,24,25)
n/an/a 17n/an/an/an/an/an/a
GlaxoSmithKline
Curated by ChEMBL
Assay Description
Inhibitory concentration against Staphylococcus aureus methionyl tRNA synthetase
Bioorg Med Chem Lett 14: 3937-41 (2004)
Article DOI: 10.1016/j.bmcl.2004.05.070
BindingDB Entry DOI: 10.7270/Q2QC02Z9