BDBM50149704 CHEMBL3771135
SMILES: Cc1cc(C)c(CNC(=O)c2cc(Br)nc3n(ncc23)C2CCN(CC2)C(=O)OC(C)(C)C)c(=O)[nH]1
InChI Key: InChIKey=YTMNEGGAZMYECL-UHFFFAOYSA-N
Data: 1 IC50
Activity Spreadsheet -- Enzyme Inhibition Constant Data from BindingDB
Found 1 hit for monomerid = 50149704
Trg + Lig
Ki
nM
ΔG°
kcal/mole
IC50
nM
Kd
nM
EC50/IC50
nM
koff
s-1
kon
M-1s-1
pHTemp
°C
Histone-lysine N-methyltransferase EZH2
(Homo sapiens (Human))
BDBM50149704
(CHEMBL3771135)
Show SMILES Cc1cc(C)c(CNC(=O)c2cc(Br)nc3n(ncc23)C2CCN(CC2)C(=O)OC(C)(C)C)c(=O)[nH]1
Show InChI InChI=1S/C25H31BrN6O4/c1-14-10-15(2)29-23(34)18(14)12-27-22(33)17-11-20(26)30-21-19(17)13-28-32(21)16-6-8-31(9-7-16)24(35)36-25(3,4)5/h10-11,13,16H,6-9,12H2,1-5H3,(H,27,33)(H,29,34)
n/an/a 200n/an/an/an/an/an/a
Epizyme
Curated by ChEMBL
Assay Description
Inhibition of methyltransferase activity of human EZH2 using chicken oligonucleotide as substrate by pull down assay
J Med Chem 59: 1556-64 (2016)
BindingDB Entry DOI: 10.7270/Q2B56MM7