BDBM50149707 5-Iodo-benzofuran-2-carboxylic acid {4-[4-(2,3-dichloro-phenyl)-piperazin-1-yl]-butyl}-amide::CHEMBL184383::N-(4-(4-(2,3-dichlorophenyl)piperazin-1-yl)butyl)-5-iodobenzofuran-2-carboxamide
SMILES: Clc1cccc(N2CCN(CCCCNC(=O)c3cc4cc(I)ccc4o3)CC2)c1Cl
InChI Key: InChIKey=OBGOWZOSTXHAGD-UHFFFAOYSA-N
Data: 9 KI  1 IC50
Activity Spreadsheet -- Enzyme Inhibition Constant Data from BindingDB
Found 10 hits for monomerid = 50149707
Trg + Lig
Ki
nM
ΔG°
kcal/mole
IC50
nM
Kd
nM
EC50/IC50
nM
koff
s-1
kon
M-1s-1
pHTemp
°C
D(3) dopamine receptor
(Homo sapiens (Human))
BDBM50149707
(5-Iodo-benzofuran-2-carboxylic acid {4-[4-(2,3-dic...)
Show SMILES Clc1cccc(N2CCN(CCCCNC(=O)c3cc4cc(I)ccc4o3)CC2)c1Cl
Show InChI InChI=1S/C23H24Cl2IN3O2/c24-18-4-3-5-19(22(18)25)29-12-10-28(11-13-29)9-2-1-8-27-23(30)21-15-16-14-17(26)6-7-20(16)31-21/h3-7,14-15H,1-2,8-13H2,(H,27,30)
1.59n/an/an/an/an/an/an/an/a
National Institute on Drug AbuseIntramural Research Program
Curated by ChEMBL
Assay Description
Displacement of [125]IABN from human D3 receptor expressed in HEK293 cells
J Med Chem 52: 2559-70 (2009)
Article DOI: 10.1021/jm900095y
BindingDB Entry DOI: 10.7270/Q2HX1DKJ
D(3) dopamine receptor
(Homo sapiens (Human))
BDBM50149707
(5-Iodo-benzofuran-2-carboxylic acid {4-[4-(2,3-dic...)
Show SMILES Clc1cccc(N2CCN(CCCCNC(=O)c3cc4cc(I)ccc4o3)CC2)c1Cl
Show InChI InChI=1S/C23H24Cl2IN3O2/c24-18-4-3-5-19(22(18)25)29-12-10-28(11-13-29)9-2-1-8-27-23(30)21-15-16-14-17(26)6-7-20(16)31-21/h3-7,14-15H,1-2,8-13H2,(H,27,30)
5.70n/an/an/an/an/an/an/an/a
University of Erlangen-Nuremberg
Curated by ChEMBL
Assay Description
Binding affinity towards human D3 receptor using [3H]-spiperone expressed in CHO cells
Bioorg Med Chem Lett 14: 3963-6 (2004)
Article DOI: 10.1016/j.bmcl.2004.05.052
BindingDB Entry DOI: 10.7270/Q2B27TQD
5-hydroxytryptamine receptor 1A
(Homo sapiens (Human))
BDBM50149707
(5-Iodo-benzofuran-2-carboxylic acid {4-[4-(2,3-dic...)
Show SMILES Clc1cccc(N2CCN(CCCCNC(=O)c3cc4cc(I)ccc4o3)CC2)c1Cl
Show InChI InChI=1S/C23H24Cl2IN3O2/c24-18-4-3-5-19(22(18)25)29-12-10-28(11-13-29)9-2-1-8-27-23(30)21-15-16-14-17(26)6-7-20(16)31-21/h3-7,14-15H,1-2,8-13H2,(H,27,30)
130n/an/an/an/an/an/an/an/a
University of Erlangen-Nuremberg
Curated by ChEMBL
Assay Description
Binding affinity towards 5-HT1A receptor from porcine cortical membranes using [3H]-8-OH-DPAT
Bioorg Med Chem Lett 14: 3963-6 (2004)
Article DOI: 10.1016/j.bmcl.2004.05.052
BindingDB Entry DOI: 10.7270/Q2B27TQD
D(2) dopamine receptor
(Homo sapiens (Human))
BDBM50149707
(5-Iodo-benzofuran-2-carboxylic acid {4-[4-(2,3-dic...)
Show SMILES Clc1cccc(N2CCN(CCCCNC(=O)c3cc4cc(I)ccc4o3)CC2)c1Cl
Show InChI InChI=1S/C23H24Cl2IN3O2/c24-18-4-3-5-19(22(18)25)29-12-10-28(11-13-29)9-2-1-8-27-23(30)21-15-16-14-17(26)6-7-20(16)31-21/h3-7,14-15H,1-2,8-13H2,(H,27,30)
Reactome pathway
430n/an/an/an/an/an/an/an/a
University of Erlangen-Nuremberg
Curated by ChEMBL
Assay Description
Binding affinity towards human D2 short receptor using [3H]-spiperone expressed in CHO cells
Bioorg Med Chem Lett 14: 3963-6 (2004)
Article DOI: 10.1016/j.bmcl.2004.05.052
BindingDB Entry DOI: 10.7270/Q2B27TQD
D(4) dopamine receptor
(Homo sapiens (Human))
BDBM50149707
(5-Iodo-benzofuran-2-carboxylic acid {4-[4-(2,3-dic...)
Show SMILES Clc1cccc(N2CCN(CCCCNC(=O)c3cc4cc(I)ccc4o3)CC2)c1Cl
Show InChI InChI=1S/C23H24Cl2IN3O2/c24-18-4-3-5-19(22(18)25)29-12-10-28(11-13-29)9-2-1-8-27-23(30)21-15-16-14-17(26)6-7-20(16)31-21/h3-7,14-15H,1-2,8-13H2,(H,27,30)
Reactome pathway
1.72E+3n/an/an/an/an/an/an/an/a
National Institute on Drug AbuseIntramural Research Program
Curated by ChEMBL
Assay Description
Displacement of [125]IABN from human D4 receptor expressed in HEK293 cells
J Med Chem 52: 2559-70 (2009)
Article DOI: 10.1021/jm900095y
BindingDB Entry DOI: 10.7270/Q2HX1DKJ
D(4) dopamine receptor
(Homo sapiens (Human))
BDBM50149707
(5-Iodo-benzofuran-2-carboxylic acid {4-[4-(2,3-dic...)
Show SMILES Clc1cccc(N2CCN(CCCCNC(=O)c3cc4cc(I)ccc4o3)CC2)c1Cl
Show InChI InChI=1S/C23H24Cl2IN3O2/c24-18-4-3-5-19(22(18)25)29-12-10-28(11-13-29)9-2-1-8-27-23(30)21-15-16-14-17(26)6-7-20(16)31-21/h3-7,14-15H,1-2,8-13H2,(H,27,30)
Reactome pathway
2.20E+3n/an/an/an/an/an/an/an/a
University of Erlangen-Nuremberg
Curated by ChEMBL
Assay Description
Binding affinity towards human D4.4 receptor using [3H]-spiperone expressed in CHO cells
Bioorg Med Chem Lett 14: 3963-6 (2004)
Article DOI: 10.1016/j.bmcl.2004.05.052
BindingDB Entry DOI: 10.7270/Q2B27TQD
D(1A) dopamine receptor
(Homo sapiens (Human))
BDBM50149707
(5-Iodo-benzofuran-2-carboxylic acid {4-[4-(2,3-dic...)
Show SMILES Clc1cccc(N2CCN(CCCCNC(=O)c3cc4cc(I)ccc4o3)CC2)c1Cl
Show InChI InChI=1S/C23H24Cl2IN3O2/c24-18-4-3-5-19(22(18)25)29-12-10-28(11-13-29)9-2-1-8-27-23(30)21-15-16-14-17(26)6-7-20(16)31-21/h3-7,14-15H,1-2,8-13H2,(H,27,30)
2.92E+3n/an/an/an/an/an/an/an/a
National Institute on Drug AbuseIntramural Research Program
Curated by ChEMBL
Assay Description
Displacement of [3H]SCH23390 from D1 receptor
J Med Chem 52: 2559-70 (2009)
Article DOI: 10.1021/jm900095y
BindingDB Entry DOI: 10.7270/Q2HX1DKJ
D(2) dopamine receptor
(Homo sapiens (Human))
BDBM50149707
(5-Iodo-benzofuran-2-carboxylic acid {4-[4-(2,3-dic...)
Show SMILES Clc1cccc(N2CCN(CCCCNC(=O)c3cc4cc(I)ccc4o3)CC2)c1Cl
Show InChI InChI=1S/C23H24Cl2IN3O2/c24-18-4-3-5-19(22(18)25)29-12-10-28(11-13-29)9-2-1-8-27-23(30)21-15-16-14-17(26)6-7-20(16)31-21/h3-7,14-15H,1-2,8-13H2,(H,27,30)
Reactome pathway
3.20E+3n/an/an/an/an/an/an/an/a
University of Erlangen-Nuremberg
Curated by ChEMBL
Assay Description
Binding affinity towards human D2 long receptor using [3H]-spiperone expressed in CHO cells
Bioorg Med Chem Lett 14: 3963-6 (2004)
Article DOI: 10.1016/j.bmcl.2004.05.052
BindingDB Entry DOI: 10.7270/Q2B27TQD
Dopamine D1 receptor
(Sus scrofa)
BDBM50149707
(5-Iodo-benzofuran-2-carboxylic acid {4-[4-(2,3-dic...)
Show SMILES Clc1cccc(N2CCN(CCCCNC(=O)c3cc4cc(I)ccc4o3)CC2)c1Cl
Show InChI InChI=1S/C23H24Cl2IN3O2/c24-18-4-3-5-19(22(18)25)29-12-10-28(11-13-29)9-2-1-8-27-23(30)21-15-16-14-17(26)6-7-20(16)31-21/h3-7,14-15H,1-2,8-13H2,(H,27,30)
3.30E+3n/an/an/an/an/an/an/an/a
University of Erlangen-Nuremberg
Curated by ChEMBL
Assay Description
Binding affinity towards D1 receptor from porcine striatal membranes using [3H]-SCH- 23390
Bioorg Med Chem Lett 14: 3963-6 (2004)
Article DOI: 10.1016/j.bmcl.2004.05.052
BindingDB Entry DOI: 10.7270/Q2B27TQD
D(3) dopamine receptor
(Homo sapiens (Human))
BDBM50149707
(5-Iodo-benzofuran-2-carboxylic acid {4-[4-(2,3-dic...)
Show SMILES Clc1cccc(N2CCN(CCCCNC(=O)c3cc4cc(I)ccc4o3)CC2)c1Cl
Show InChI InChI=1S/C23H24Cl2IN3O2/c24-18-4-3-5-19(22(18)25)29-12-10-28(11-13-29)9-2-1-8-27-23(30)21-15-16-14-17(26)6-7-20(16)31-21/h3-7,14-15H,1-2,8-13H2,(H,27,30)
n/an/a 520n/an/an/an/an/an/a
National Institute on Drug AbuseIntramural Research Program
Curated by ChEMBL
Assay Description
Antagonist activity at human D3 receptor expressed in HEK293 cells assessed as inhibition of quinpirole-stimulated mitogenesis
J Med Chem 52: 2559-70 (2009)
Article DOI: 10.1021/jm900095y
BindingDB Entry DOI: 10.7270/Q2HX1DKJ