BDBM50149800 5-(2-Methyl-thiazol-4-ylethynyl)-[3,4'']bipyridinyl::CHEMBL182130
SMILES: Cc1nc(cs1)C#Cc1cncc(c1)-c1ccncc1
InChI Key: InChIKey=ZWHQOIOUVWTJNC-UHFFFAOYSA-N
Data: 1 KI  1 IC50
Activity Spreadsheet -- Enzyme Inhibition Constant Data from BindingDB
Found 2 hits for monomerid = 50149800
Trg + Lig
Ki
nM
ΔG°
kcal/mole
IC50
nM
Kd
nM
EC50/IC50
nM
koff
s-1
kon
M-1s-1
pHTemp
°C
Metabotropic glutamate receptor
(Rattus norvegicus (Rat))
BDBM50149800
(5-(2-Methyl-thiazol-4-ylethynyl)-[3,4'']bipyridiny...)
Show SMILES Cc1nc(cs1)C#Cc1cncc(c1)-c1ccncc1
Show InChI InChI=1S/C16H11N3S/c1-12-19-16(11-20-12)3-2-13-8-15(10-18-9-13)14-4-6-17-7-5-14/h4-11H,1H3
Reactome pathway
15n/an/an/an/an/an/an/an/a
Merck Research Laboratories
Curated by ChEMBL
Assay Description
Displacement by compound of [3H]-3-methoxy-5-(pyridin-2-ylethynyl)pyridine from rat cortical membranes
Bioorg Med Chem Lett 14: 3993-6 (2004)
Article DOI: 10.1016/j.bmcl.2004.05.037
BindingDB Entry DOI: 10.7270/Q2T43SKQ
Metabotropic glutamate receptor 5
(Homo sapiens (Human))
BDBM50149800
(5-(2-Methyl-thiazol-4-ylethynyl)-[3,4'']bipyridiny...)
Show SMILES Cc1nc(cs1)C#Cc1cncc(c1)-c1ccncc1
Show InChI InChI=1S/C16H11N3S/c1-12-19-16(11-20-12)3-2-13-8-15(10-18-9-13)14-4-6-17-7-5-14/h4-11H,1H3
n/an/a 18n/an/an/an/an/an/a
Merck Research Laboratories
Curated by ChEMBL
Assay Description
In vitro potency against human recombinant mGlu5 receptor was determined by [Ca2+] flux assay using glutamate as agonist
Bioorg Med Chem Lett 14: 3993-6 (2004)
Article DOI: 10.1016/j.bmcl.2004.05.037
BindingDB Entry DOI: 10.7270/Q2T43SKQ