BDBM50149802 2-Methyl-4-m-tolylethynyl-thiazole::2-methyl-4-(m-tolylethynyl)thiazole::CHEMBL182950
SMILES: Cc1nc(cs1)C#Cc1cccc(C)c1
InChI Key: InChIKey=LYHRSGPNRBPYDG-UHFFFAOYSA-N
Data: 1 KI  2 IC50
Activity Spreadsheet -- Enzyme Inhibition Constant Data from BindingDB
Found 3 hits for monomerid = 50149802
Trg + Lig
Ki
nM
ΔG°
kcal/mole
IC50
nM
Kd
nM
EC50/IC50
nM
koff
s-1
kon
M-1s-1
pHTemp
°C
Metabotropic glutamate receptor
(Rattus norvegicus (Rat))
BDBM50149802
(2-Methyl-4-m-tolylethynyl-thiazole | 2-methyl-4-(m...)
Show SMILES Cc1nc(cs1)C#Cc1cccc(C)c1
Show InChI InChI=1S/C13H11NS/c1-10-4-3-5-12(8-10)6-7-13-9-15-11(2)14-13/h3-5,8-9H,1-2H3
Reactome pathway
10n/an/an/an/an/an/an/an/a
Merck Research Laboratories
Curated by ChEMBL
Assay Description
Displacement by compound of [3H]-3-methoxy-5-(pyridin-2-ylethynyl)pyridine from rat cortical membranes
Bioorg Med Chem Lett 14: 3993-6 (2004)
Article DOI: 10.1016/j.bmcl.2004.05.037
BindingDB Entry DOI: 10.7270/Q2T43SKQ
Metabotropic glutamate receptor 5
(Homo sapiens (Human))
BDBM50149802
(2-Methyl-4-m-tolylethynyl-thiazole | 2-methyl-4-(m...)
Show SMILES Cc1nc(cs1)C#Cc1cccc(C)c1
Show InChI InChI=1S/C13H11NS/c1-10-4-3-5-12(8-10)6-7-13-9-15-11(2)14-13/h3-5,8-9H,1-2H3
n/an/a 82.6n/an/an/an/an/an/a
University of Illinois at Chicago
Curated by ChEMBL
Assay Description
Activity in agonist-induced phosphoinositide hydrolysis in CHO cells expressing mGluR5a
J Med Chem 49: 1080-100 (2006)
Article DOI: 10.1021/jm050570f
BindingDB Entry DOI: 10.7270/Q27S7NC5
Metabotropic glutamate receptor 5
(Homo sapiens (Human))
BDBM50149802
(2-Methyl-4-m-tolylethynyl-thiazole | 2-methyl-4-(m...)
Show SMILES Cc1nc(cs1)C#Cc1cccc(C)c1
Show InChI InChI=1S/C13H11NS/c1-10-4-3-5-12(8-10)6-7-13-9-15-11(2)14-13/h3-5,8-9H,1-2H3
n/an/a 2n/an/an/an/an/an/a
Merck Research Laboratories
Curated by ChEMBL
Assay Description
In vitro potency against human recombinant mGlu5 receptor was determined by [Ca2+] flux assay using glutamate as agonist
Bioorg Med Chem Lett 14: 3993-6 (2004)
Article DOI: 10.1016/j.bmcl.2004.05.037
BindingDB Entry DOI: 10.7270/Q2T43SKQ