BDBM50149883 CHEMBL3770619
SMILES: Cc1cc(C)c(CNC(=O)c2cc(Br)cc(NC3CCOCC3)c2C)c(=O)[nH]1
InChI Key: InChIKey=RCZGRIAXFXHZJU-UHFFFAOYSA-N
Data: 1 IC50
Activity Spreadsheet -- Enzyme Inhibition Constant Data from BindingDB
Found 1 hit for monomerid = 50149883
Trg + Lig
Ki
nM
ΔG°
kcal/mole
IC50
nM
Kd
nM
EC50/IC50
nM
koff
s-1
kon
M-1s-1
pHTemp
°C
Histone-lysine N-methyltransferase EZH2
(Homo sapiens (Human))
BDBM50149883
(CHEMBL3770619)
Show SMILES Cc1cc(C)c(CNC(=O)c2cc(Br)cc(NC3CCOCC3)c2C)c(=O)[nH]1
Show InChI InChI=1S/C21H26BrN3O3/c1-12-8-13(2)24-21(27)18(12)11-23-20(26)17-9-15(22)10-19(14(17)3)25-16-4-6-28-7-5-16/h8-10,16,25H,4-7,11H2,1-3H3,(H,23,26)(H,24,27)
n/an/a 500n/an/an/an/an/an/a
Epizyme
Curated by ChEMBL
Assay Description
Inhibition of methyltransferase activity of human EZH2 using chicken oligonucleotide as substrate by pull down assay
J Med Chem 59: 1556-64 (2016)
BindingDB Entry DOI: 10.7270/Q2B56MM7