BDBM50149884 CHEMBL3770973
SMILES: CN(C1CCOCC1)c1cc(Br)cc(C(=O)NCc2c(C)cc(C)[nH]c2=O)c1C
InChI Key: InChIKey=JNTZMURDCWYVPI-UHFFFAOYSA-N
Data: 1 IC50  1 EC50
Activity Spreadsheet -- Enzyme Inhibition Constant Data from BindingDB
Found 2 hits for monomerid = 50149884
Trg + Lig
Ki
nM
ΔG°
kcal/mole
IC50
nM
Kd
nM
EC50/IC50
nM
koff
s-1
kon
M-1s-1
pHTemp
°C
Histone-lysine N-methyltransferase EZH2
(Homo sapiens (Human))
BDBM50149884
(CHEMBL3770973)
Show SMILES CN(C1CCOCC1)c1cc(Br)cc(C(=O)NCc2c(C)cc(C)[nH]c2=O)c1C
Show InChI InChI=1S/C22H28BrN3O3/c1-13-9-14(2)25-22(28)19(13)12-24-21(27)18-10-16(23)11-20(15(18)3)26(4)17-5-7-29-8-6-17/h9-11,17H,5-8,12H2,1-4H3,(H,24,27)(H,25,28)
n/an/an/an/a 300n/an/an/an/a
Epizyme
Curated by ChEMBL
Assay Description
Inhibition of methyltransferase activity of EZH2 in human G401 cells assessed as H3K27 trimethylation after 4 hrs by ELISA
J Med Chem 59: 1556-64 (2016)
BindingDB Entry DOI: 10.7270/Q2B56MM7
Histone-lysine N-methyltransferase EZH2
(Homo sapiens (Human))
BDBM50149884
(CHEMBL3770973)
Show SMILES CN(C1CCOCC1)c1cc(Br)cc(C(=O)NCc2c(C)cc(C)[nH]c2=O)c1C
Show InChI InChI=1S/C22H28BrN3O3/c1-13-9-14(2)25-22(28)19(13)12-24-21(27)18-10-16(23)11-20(15(18)3)26(4)17-5-7-29-8-6-17/h9-11,17H,5-8,12H2,1-4H3,(H,24,27)(H,25,28)
n/an/a 30n/an/an/an/an/an/a
Epizyme
Curated by ChEMBL
Assay Description
Inhibition of methyltransferase activity of human EZH2 using chicken oligonucleotide as substrate by pull down assay
J Med Chem 59: 1556-64 (2016)
BindingDB Entry DOI: 10.7270/Q2B56MM7