BDBM50149919 CHEMBL3769744
SMILES: O=c1[nH]c(Oc2cnn(c2)C2CCCCC2)nc2cnccc12
InChI Key: InChIKey=IPGKSXQOVKSOCC-NDEPHWFRSA-N
Data: 2 IC50
Activity Spreadsheet -- Enzyme Inhibition Constant Data from BindingDB
Found 2 hits for monomerid = 50149919
Trg + Lig
Ki
nM
ΔG°
kcal/mole
IC50
nM
Kd
nM
EC50/IC50
nM
koff
s-1
kon
M-1s-1
pHTemp
°C
Lysine-specific demethylase 4C
(Homo sapiens (Human))
BDBM50149919
(CHEMBL3769744)
Show SMILES O=c1[nH]c(Oc2cnn(c2)C2CCCCC2)nc2cnccc12
Show InChI InChI=1S/C32H38ClN5O4/c1-37(18-19-42-2)22-25-8-4-5-9-27(25)23-10-12-24(13-11-23)31(40)35-28(32(41)38-16-6-3-7-17-38)20-30(39)36-29-15-14-26(33)21-34-29/h4-5,8-15,21,28H,3,6-7,16-20,22H2,1-2H3,(H,35,40)(H,34,36,39)/t28-/m0/s1
n/an/a 3.98E+3n/an/an/an/an/an/a
GlaxoSmithKline R&D
Curated by ChEMBL
Assay Description
Inhibition of N-terminal his-tagged full-length human KDM4C transfected in U2OS cells assessed as inhibition of H3K9Me3 demethylation for 24 hrs
J Med Chem 59: 1370-87 (2016)
BindingDB Entry DOI: 10.7270/Q26D5VV2
Lysine-specific demethylase 4C
(Homo sapiens (Human))
BDBM50149919
(CHEMBL3769744)
Show SMILES O=c1[nH]c(Oc2cnn(c2)C2CCCCC2)nc2cnccc12
Show InChI InChI=1S/C32H38ClN5O4/c1-37(18-19-42-2)22-25-8-4-5-9-27(25)23-10-12-24(13-11-23)31(40)35-28(32(41)38-16-6-3-7-17-38)20-30(39)36-29-15-14-26(33)21-34-29/h4-5,8-15,21,28H,3,6-7,16-20,22H2,1-2H3,(H,35,40)(H,34,36,39)/t28-/m0/s1
n/an/a 398n/an/an/an/an/an/a
GlaxoSmithKline R&D
Curated by ChEMBL
Assay Description
Inhibition of N-terminal his-tagged human KDM4C expressed in Escherichia coli BL21(DE3) using trimethylated peptide substrate by RFMS assay
J Med Chem 59: 1370-87 (2016)
BindingDB Entry DOI: 10.7270/Q26D5VV2