BDBM50150035 CHEMBL3769687
SMILES: Cc1nc2c(c(Cl)c(Cl)cc2n1Cc1ccccc1)[N+]([O-])=O
InChI Key: InChIKey=WMXUACCXYUMDPO-UHFFFAOYSA-N
Data: 1 IC50
Activity Spreadsheet -- Enzyme Inhibition Constant Data from BindingDB
Found 1 hit for monomerid = 50150035
Trg + Lig
Ki
nM
ΔG°
kcal/mole
IC50
nM
Kd
nM
EC50/IC50
nM
koff
s-1
kon
M-1s-1
pHTemp
°C
dCTP pyrophosphatase 1 (DCTPP1)
(Homo sapiens (Human))
BDBM50150035
(CHEMBL3769687)
Show SMILES Cc1nc2c(c(Cl)c(Cl)cc2n1Cc1ccccc1)[N+]([O-])=O
Show InChI InChI=1S/C15H11Cl2N3O2/c1-9-18-14-12(7-11(16)13(17)15(14)20(21)22)19(9)8-10-5-3-2-4-6-10/h2-7H,8H2,1H3
n/an/a 49n/an/an/an/an/an/a
Karolinska Institutet
Curated by ChEMBL
Assay Description
Inhibition of human recombinant full length dCTPase expressed in Escherichia coli BL21(DE3)pLysS using dCTP as substrate after 1 hr by HTS-adapted Ma...
J Med Chem 59: 1140-8 (2016)
BindingDB Entry DOI: 10.7270/Q2959KDZ