null
SMILES: COc1ccc(Cn2c(C)nc3c(c(Cl)c(Cl)cc23)[N+]([O-])=O)cc1
InChI Key: InChIKey=MPGLPIATJGBRKR-UHFFFAOYSA-N
Activity Spreadsheet -- Enzyme Inhibition Constant Data from BindingDB
Found 1 hit for monomerid = 50150036
Trg + Lig
Ki
nM
ΔG°
kcal/mole
IC50
nM
Kd
nM
EC50/IC50
nM
koff
s-1
kon
M-1s-1
pHTemp
°C
dCTP pyrophosphatase 1
(Homo sapiens (Human))
BDBM50150036
(CHEMBL3771227)
Show SMILES COc1ccc(Cn2c(C)nc3c(c(Cl)c(Cl)cc23)[N+]([O-])=O)cc1
Show InChI InChI=1S/C16H13Cl2N3O3/c1-9-19-15-13(7-12(17)14(18)16(15)21(22)23)20(9)8-10-3-5-11(24-2)6-4-10/h3-7H,8H2,1-2H3
n/an/a 41n/an/an/an/an/an/a
Karolinska Institutet
Curated by ChEMBL
Assay Description
Inhibition of human recombinant full length dCTPase expressed in Escherichia coli BL21(DE3)pLysS using dCTP as substrate after 1 hr by HTS-adapted Ma...
J Med Chem 59: 1140-8 (2016)
BindingDB Entry DOI: 10.7270/Q2959KDZ