null
SMILES: CO[C@H]1CC(C)=Cc2c(O)c(NC(=O)C(C)=CC=C[C@H](OC)[C@@H](OC(N)=O)\C(C)=C\[C@H](C)[C@H]1O)cc(O)c2NC(=O)c1ccc(CN2CCN(CC2)c2ccc(cc2)[N+]([O-])=O)cc1
InChI Key: InChIKey=MZVWEZUMTIMUQK-AFVVGKOPSA-N
Activity Spreadsheet -- Enzyme Inhibition Constant Data from BindingDB
Found 3 hits for monomerid = 50150182
Trg + Lig
Ki
nM
ΔG°
kcal/mole
IC50
nM
Kd
nM
EC50/IC50
nM
koff
s-1
kon
M-1s-1
pHTemp
°C
Heat shock protein HSP 90-alpha/90-beta
(Homo sapiens (Human))
BDBM50150182
(CHEMBL127821 | Carbamic acid (4E,6Z,10E)-(8S,9S,12...)
Show SMILES CO[C@H]1CC(C)=Cc2c(O)c(NC(=O)C(C)=CC=C[C@H](OC)[C@@H](OC(N)=O)\C(C)=C\[C@H](C)[C@H]1O)cc(O)c2NC(=O)c1ccc(CN2CCN(CC2)c2ccc(cc2)[N+]([O-])=O)cc1 |w:6.6,16.16,t:28|
Show InChI InChI=1S/C46H56N6O11/c1-27-22-35-40(49-45(57)32-12-10-31(11-13-32)26-50-18-20-51(21-19-50)33-14-16-34(17-15-33)52(59)60)37(53)25-36(42(35)55)48-44(56)28(2)8-7-9-38(61-5)43(63-46(47)58)30(4)24-29(3)41(54)39(23-27)62-6/h7-17,22,24-25,29,38-39,41,43,53-55H,18-21,23,26H2,1-6H3,(H2,47,58)(H,48,56)(H,49,57)/b9-7?,27-22?,28-8?,30-24+/t29-,38-,39-,41+,43-/m0/s1
Reactome pathway
n/an/a 200n/an/an/an/an/an/a
Conforma Therapeutics Corporation
Curated by ChEMBL
Assay Description
Inhibition of human epidermal growth factor 2 (Her-2) degredation in MCF-7 cells
J Med Chem 47: 3865-73 (2004)
Article DOI: 10.1021/jm0306125
BindingDB Entry DOI: 10.7270/Q2NC60N3
Heat shock protein HSP 90-alpha/90-beta
(Homo sapiens (Human))
BDBM50150182
(CHEMBL127821 | Carbamic acid (4E,6Z,10E)-(8S,9S,12...)
Show SMILES CO[C@H]1CC(C)=Cc2c(O)c(NC(=O)C(C)=CC=C[C@H](OC)[C@@H](OC(N)=O)\C(C)=C\[C@H](C)[C@H]1O)cc(O)c2NC(=O)c1ccc(CN2CCN(CC2)c2ccc(cc2)[N+]([O-])=O)cc1 |w:6.6,16.16,t:28|
Show InChI InChI=1S/C46H56N6O11/c1-27-22-35-40(49-45(57)32-12-10-31(11-13-32)26-50-18-20-51(21-19-50)33-14-16-34(17-15-33)52(59)60)37(53)25-36(42(35)55)48-44(56)28(2)8-7-9-38(61-5)43(63-46(47)58)30(4)24-29(3)41(54)39(23-27)62-6/h7-17,22,24-25,29,38-39,41,43,53-55H,18-21,23,26H2,1-6H3,(H2,47,58)(H,48,56)(H,49,57)/b9-7?,27-22?,28-8?,30-24+/t29-,38-,39-,41+,43-/m0/s1
Reactome pathway
n/an/a 1.00E+3n/an/an/an/an/an/a
Conforma Therapeutics Corporation
Curated by ChEMBL
Assay Description
Concentration required to inhibit biotin-GM binding to recombinant heat shock protein 90(rHsp90)
J Med Chem 47: 3865-73 (2004)
Article DOI: 10.1021/jm0306125
BindingDB Entry DOI: 10.7270/Q2NC60N3
Heat shock protein HSP 90-alpha/90-beta
(Homo sapiens (Human))
BDBM50150182
(CHEMBL127821 | Carbamic acid (4E,6Z,10E)-(8S,9S,12...)
Show SMILES CO[C@H]1CC(C)=Cc2c(O)c(NC(=O)C(C)=CC=C[C@H](OC)[C@@H](OC(N)=O)\C(C)=C\[C@H](C)[C@H]1O)cc(O)c2NC(=O)c1ccc(CN2CCN(CC2)c2ccc(cc2)[N+]([O-])=O)cc1 |w:6.6,16.16,t:28|
Show InChI InChI=1S/C46H56N6O11/c1-27-22-35-40(49-45(57)32-12-10-31(11-13-32)26-50-18-20-51(21-19-50)33-14-16-34(17-15-33)52(59)60)37(53)25-36(42(35)55)48-44(56)28(2)8-7-9-38(61-5)43(63-46(47)58)30(4)24-29(3)41(54)39(23-27)62-6/h7-17,22,24-25,29,38-39,41,43,53-55H,18-21,23,26H2,1-6H3,(H2,47,58)(H,48,56)(H,49,57)/b9-7?,27-22?,28-8?,30-24+/t29-,38-,39-,41+,43-/m0/s1
Reactome pathway
n/an/a 1.30E+3n/an/an/an/an/an/a
Conforma Therapeutics Corporation
Curated by ChEMBL
Assay Description
Concentration required to inhbit Bis-ANS activity by recombinant heat shock protein 90 (rHSP90) conformational assay
J Med Chem 47: 3865-73 (2004)
Article DOI: 10.1021/jm0306125
BindingDB Entry DOI: 10.7270/Q2NC60N3