null
SMILES: CSCC[C@H](NC(=O)[C@H]1O[C@@H](CNC(=O)[C@@H](N)CSSC(C)(C)C)CC[C@@H]1OCc1ccccc1)C(O)=O
InChI Key: InChIKey=KKJHVJLHXZFOFV-FXTUREPZSA-N
Activity Spreadsheet -- Enzyme Inhibition Constant Data from BindingDB
Found 2 hits for monomerid = 50150667
Trg + Lig
Ki
nM
ΔG°
kcal/mole
IC50
nM
Kd
nM
EC50/IC50
nM
koff
s-1
kon
M-1s-1
pHTemp
°C
Geranylgeranyl transferase type-1 subunit beta/Protein farnesyltransferase/geranylgeranyltransferase type-1 subunit alpha
(Homo sapiens (Human))
BDBM50150667
((S)-2-({(2S,3S,6R)-6-[((R)-2-Amino-3-tert-butyldis...)
Show SMILES CSCC[C@H](NC(=O)[C@H]1O[C@@H](CNC(=O)[C@@H](N)CSSC(C)(C)C)CC[C@@H]1OCc1ccccc1)C(O)=O
Show InChI InChI=1S/C26H41N3O6S3/c1-26(2,3)38-37-16-19(27)23(30)28-14-18-10-11-21(34-15-17-8-6-5-7-9-17)22(35-18)24(31)29-20(25(32)33)12-13-36-4/h5-9,18-22H,10-16,27H2,1-4H3,(H,28,30)(H,29,31)(H,32,33)/t18-,19+,20+,21+,22+/m1/s1
n/an/a>1.00E+6n/an/an/an/an/an/a
Leiden University
Curated by ChEMBL
Assay Description
Inhibition of [3H]GGPP incorporation by Protein Geranylgeranyl transferase type I
J Med Chem 47: 3920-3 (2004)
Article DOI: 10.1021/jm049927q
BindingDB Entry DOI: 10.7270/Q2FT8MT5
Protein farnesyltransferase subunit beta/geranylgeranyltransferase type-1 subunit alpha
(Homo sapiens (Human))
BDBM50150667
((S)-2-({(2S,3S,6R)-6-[((R)-2-Amino-3-tert-butyldis...)
Show SMILES CSCC[C@H](NC(=O)[C@H]1O[C@@H](CNC(=O)[C@@H](N)CSSC(C)(C)C)CC[C@@H]1OCc1ccccc1)C(O)=O
Show InChI InChI=1S/C26H41N3O6S3/c1-26(2,3)38-37-16-19(27)23(30)28-14-18-10-11-21(34-15-17-8-6-5-7-9-17)22(35-18)24(31)29-20(25(32)33)12-13-36-4/h5-9,18-22H,10-16,27H2,1-4H3,(H,28,30)(H,29,31)(H,32,33)/t18-,19+,20+,21+,22+/m1/s1
Reactome pathway
n/an/a 250n/an/an/an/an/an/a
Leiden University
Curated by ChEMBL
Assay Description
Inhibition of [3H]FPP incorporation by Protein Farnesyltransferase
J Med Chem 47: 3920-3 (2004)
Article DOI: 10.1021/jm049927q
BindingDB Entry DOI: 10.7270/Q2FT8MT5