BDBM50150820 CHEMBL3774933
SMILES: CCCOc1cc(OCCCCN)cc(Oc2cc3n(C)c(=O)n(C)c3cc2NS(=O)(=O)c2ccc(OC)c(OC)c2)c1
InChI Key: InChIKey=QPZLILYRGDXDKP-UHFFFAOYSA-N
Data: 1 IC50  1 EC50
Activity Spreadsheet -- Enzyme Inhibition Constant Data from BindingDB
Found 2 hits for monomerid = 50150820
Trg + Lig
Ki
nM
ΔG°
kcal/mole
IC50
nM
Kd
nM
EC50/IC50
nM
koff
s-1
kon
M-1s-1
pHTemp
°C
Transcription intermediary factor 1-alpha
(Homo sapiens (Human))
BDBM50150820
(CHEMBL3774933)
Show SMILES CCCOc1cc(OCCCCN)cc(Oc2cc3n(C)c(=O)n(C)c3cc2NS(=O)(=O)c2ccc(OC)c(OC)c2)c1
Show InChI InChI=1S/C30H38N4O8S/c1-6-12-40-20-14-21(41-13-8-7-11-31)16-22(15-20)42-28-19-26-25(33(2)30(35)34(26)3)18-24(28)32-43(36,37)23-9-10-27(38-4)29(17-23)39-5/h9-10,14-19,32H,6-8,11-13,31H2,1-5H3
n/an/an/an/a 59n/an/an/an/a
The University of Texas MD Anderson Cancer Center
Curated by ChEMBL
Assay Description
Inhibition of human N-terminal His-tagged KDM4A (1 to 359 residues) expressed in Escherichia coli using biotin-H3K9me3 as substrate preincubated for ...
J Med Chem 59: 1440-54 (2016)
BindingDB Entry DOI: 10.7270/Q26975F4
Transcription intermediary factor 1-alpha
(Homo sapiens (Human))
BDBM50150820
(CHEMBL3774933)
Show SMILES CCCOc1cc(OCCCCN)cc(Oc2cc3n(C)c(=O)n(C)c3cc2NS(=O)(=O)c2ccc(OC)c(OC)c2)c1
Show InChI InChI=1S/C30H38N4O8S/c1-6-12-40-20-14-21(41-13-8-7-11-31)16-22(15-20)42-28-19-26-25(33(2)30(35)34(26)3)18-24(28)32-43(36,37)23-9-10-27(38-4)29(17-23)39-5/h9-10,14-19,32H,6-8,11-13,31H2,1-5H3
n/an/a 8.30n/an/an/an/an/an/a
The University of Texas MD Anderson Cancer Center
Curated by ChEMBL
Assay Description
Inhibition of human N-terminal His-tagged KDM4A (1 to 359 residues) expressed in Escherichia coli using biotin-H3K9me3 as substrate preincubated for ...
J Med Chem 59: 1440-54 (2016)
BindingDB Entry DOI: 10.7270/Q26975F4