BDBM50151057 CHEMBL3770726
SMILES: O=C(N[C@H]1CNC1=O)OCCCCC1CCCCC1
InChI Key: InChIKey=FNLUJRBWJBUJTC-LBPRGKRZSA-N
Data: 10 IC50
Activity Spreadsheet -- Enzyme Inhibition Constant Data from BindingDB
Found 10 hits for monomerid = 50151057
Trg + Lig
Ki
nM
ΔG°
kcal/mole
IC50
nM
Kd
nM
EC50/IC50
nM
koff
s-1
kon
M-1s-1
pHTemp
°C
N-acylethanolamine-hydrolyzing acid amidase
(Homo sapiens (Human))
BDBM50151057
(CHEMBL3770726)
Show SMILES O=C(N[C@H]1CNC1=O)OCCCCC1CCCCC1 |r|
Show InChI InChI=1S/C14H24N2O3/c17-13-12(10-15-13)16-14(18)19-9-5-4-8-11-6-2-1-3-7-11/h11-12H,1-10H2,(H,15,17)(H,16,18)/t12-/m0/s1
n/an/a 73n/an/an/an/an/an/a
Italian Institute of Technology
Curated by ChEMBL
Assay Description
Inhibition of GST-tagged human BRD4 bromodomain1 using H4KAc 5/8/12/16 peptide as substrate incubated overnight by HTRF assay
Eur J Med Chem 111: 138-59 (2016)
BindingDB Entry DOI: 10.7270/Q2GQ70MX
N-acylethanolamine-hydrolyzing acid amidase
(Homo sapiens (Human))
BDBM50151057
(CHEMBL3770726)
Show SMILES O=C(N[C@H]1CNC1=O)OCCCCC1CCCCC1 |r|
Show InChI InChI=1S/C14H24N2O3/c17-13-12(10-15-13)16-14(18)19-9-5-4-8-11-6-2-1-3-7-11/h11-12H,1-10H2,(H,15,17)(H,16,18)/t12-/m0/s1
n/an/a 27n/an/an/an/an/an/a
Italian Institute of Technology
Curated by ChEMBL
Assay Description
Inhibition of recombinant human NAAA expressed in HEK293 cells after 30 mins by UPLC/MS analysis
Eur J Med Chem 111: 138-59 (2016)
BindingDB Entry DOI: 10.7270/Q2GQ70MX
Acid ceramidase (AC)
(Homo sapiens (Human))
BDBM50151057
(CHEMBL3770726)
Show SMILES O=C(N[C@H]1CNC1=O)OCCCCC1CCCCC1 |r|
Show InChI InChI=1S/C14H24N2O3/c17-13-12(10-15-13)16-14(18)19-9-5-4-8-11-6-2-1-3-7-11/h11-12H,1-10H2,(H,15,17)(H,16,18)/t12-/m0/s1
n/an/a 6.27E+3n/an/an/an/an/an/a
Italian Institute of Technology
Curated by ChEMBL
Assay Description
Inhibition of human acid ceramidase by UPLC/MS analysis
Eur J Med Chem 111: 138-59 (2016)
BindingDB Entry DOI: 10.7270/Q2GQ70MX
N-acylethanolamine-hydrolyzing acid amidase (NAAA)
(Rattus norvegicus (Rat))
BDBM50151057
(CHEMBL3770726)
Show SMILES O=C(N[C@H]1CNC1=O)OCCCCC1CCCCC1 |r|
Show InChI InChI=1S/C14H24N2O3/c17-13-12(10-15-13)16-14(18)19-9-5-4-8-11-6-2-1-3-7-11/h11-12H,1-10H2,(H,15,17)(H,16,18)/t12-/m0/s1
n/an/a 28n/an/an/an/an/an/a
Istituto Italiano di Tecnologia
Curated by ChEMBL
Assay Description
Inhibition of rat NAAA expressed in HEK cells after 30 mins
Eur J Med Chem 126: 561-575 (2017)
BindingDB Entry DOI: 10.7270/Q25H7JHB
N-acylethanolamine-hydrolyzing acid amidase (NAAA)
(Rattus norvegicus (Rat))
BDBM50151057
(CHEMBL3770726)
Show SMILES O=C(N[C@H]1CNC1=O)OCCCCC1CCCCC1 |r|
Show InChI InChI=1S/C14H24N2O3/c17-13-12(10-15-13)16-14(18)19-9-5-4-8-11-6-2-1-3-7-11/h11-12H,1-10H2,(H,15,17)(H,16,18)/t12-/m0/s1
n/an/a 13n/an/an/an/an/an/a
University of California
Curated by ChEMBL
Assay Description
Inhibition of rat NAAA
J Med Chem 63: 7475-7490 (2020)
N-acylethanolamine-hydrolyzing acid amidase
(Homo sapiens (Human))
BDBM50151057
(CHEMBL3770726)
Show SMILES O=C(N[C@H]1CNC1=O)OCCCCC1CCCCC1 |r|
Show InChI InChI=1S/C14H24N2O3/c17-13-12(10-15-13)16-14(18)19-9-5-4-8-11-6-2-1-3-7-11/h11-12H,1-10H2,(H,15,17)(H,16,18)/t12-/m0/s1
n/an/a 27n/an/an/an/an/an/a
Universit£ de Lille
Curated by ChEMBL
Assay Description
Inhibition recombinant human NAAA expressed in HEK293 cells after 10 mins
J Med Chem 60: 4-46 (2017)
Article DOI: 10.1021/acs.jmedchem.6b00538
BindingDB Entry DOI: 10.7270/Q2348NZC
N-acylethanolamine-hydrolyzing acid amidase (NAAA)
(Rattus norvegicus (Rat))
BDBM50151057
(CHEMBL3770726)
Show SMILES O=C(N[C@H]1CNC1=O)OCCCCC1CCCCC1 |r|
Show InChI InChI=1S/C14H24N2O3/c17-13-12(10-15-13)16-14(18)19-9-5-4-8-11-6-2-1-3-7-11/h11-12H,1-10H2,(H,15,17)(H,16,18)/t12-/m0/s1
n/an/a 63n/an/an/an/an/an/a
Universit£ de Lille
Curated by ChEMBL
Assay Description
Inhibition of recombinant Sprague-Dawley rat NAAA expressed in HEK293 cells after 10 mins
J Med Chem 60: 4-46 (2017)
Article DOI: 10.1021/acs.jmedchem.6b00538
BindingDB Entry DOI: 10.7270/Q2348NZC
N-acylethanolamine-hydrolyzing acid amidase
(Homo sapiens (Human))
BDBM50151057
(CHEMBL3770726)
Show SMILES O=C(N[C@H]1CNC1=O)OCCCCC1CCCCC1 |r|
Show InChI InChI=1S/C14H24N2O3/c17-13-12(10-15-13)16-14(18)19-9-5-4-8-11-6-2-1-3-7-11/h11-12H,1-10H2,(H,15,17)(H,16,18)/t12-/m0/s1
n/an/a 27n/an/an/an/an/an/a
University of California
Curated by ChEMBL
Assay Description
Inhibition of recombinant human NAAA expressed in HEK cells
J Med Chem 63: 7475-7490 (2020)
N-acylethanolamine-hydrolyzing acid amidase
(Homo sapiens (Human))
BDBM50151057
(CHEMBL3770726)
Show SMILES O=C(N[C@H]1CNC1=O)OCCCCC1CCCCC1 |r|
Show InChI InChI=1S/C14H24N2O3/c17-13-12(10-15-13)16-14(18)19-9-5-4-8-11-6-2-1-3-7-11/h11-12H,1-10H2,(H,15,17)(H,16,18)/t12-/m0/s1
n/an/a 6n/an/an/an/an/an/a
University of California
Curated by ChEMBL
Assay Description
Inhibition of human NAAA
J Med Chem 63: 7475-7490 (2020)
N-acylethanolamine-hydrolyzing acid amidase
(Homo sapiens (Human))
BDBM50151057
(CHEMBL3770726)
Show SMILES O=C(N[C@H]1CNC1=O)OCCCCC1CCCCC1 |r|
Show InChI InChI=1S/C14H24N2O3/c17-13-12(10-15-13)16-14(18)19-9-5-4-8-11-6-2-1-3-7-11/h11-12H,1-10H2,(H,15,17)(H,16,18)/t12-/m0/s1
n/an/a 73n/an/an/an/an/an/a
Istituto Italiano di Tecnologia
Curated by ChEMBL
Assay Description
Inhibition of recombinant human NAAA expressed in HEK cells after 30 mins
Eur J Med Chem 126: 561-575 (2017)
BindingDB Entry DOI: 10.7270/Q25H7JHB