BDBM50151096 CHEMBL3769689
SMILES: CCCOc1ccc(COC(=O)N[C@H]2CNC2=O)cc1
InChI Key: InChIKey=YPMNHNKWLFDHSJ-LBPRGKRZSA-N
Data: 3 IC50
Activity Spreadsheet -- Enzyme Inhibition Constant Data from BindingDB
Found 3 hits for monomerid = 50151096
Trg + Lig
Ki
nM
ΔG°
kcal/mole
IC50
nM
Kd
nM
EC50/IC50
nM
koff
s-1
kon
M-1s-1
pHTemp
°C
N-acylethanolamine-hydrolyzing acid amidase
(Homo sapiens (Human))
BDBM50151096
(CHEMBL3769689)
Show SMILES CCCOc1ccc(COC(=O)N[C@H]2CNC2=O)cc1 |r|
Show InChI InChI=1S/C14H18N2O4/c1-2-7-19-11-5-3-10(4-6-11)9-20-14(18)16-12-8-15-13(12)17/h3-6,12H,2,7-9H2,1H3,(H,15,17)(H,16,18)/t12-/m0/s1
n/an/a 250n/an/an/an/an/an/a
Italian Institute of Technology
Curated by ChEMBL
Assay Description
Inhibition of GST-tagged human BRD4 bromodomain2 using H4KAc 5/8/12/16 peptide as substrate incubated overnight by HTRF assay
Eur J Med Chem 111: 138-59 (2016)
BindingDB Entry DOI: 10.7270/Q2GQ70MX
Acid ceramidase (AC)
(Homo sapiens (Human))
BDBM50151096
(CHEMBL3769689)
Show SMILES CCCOc1ccc(COC(=O)N[C@H]2CNC2=O)cc1 |r|
Show InChI InChI=1S/C14H18N2O4/c1-2-7-19-11-5-3-10(4-6-11)9-20-14(18)16-12-8-15-13(12)17/h3-6,12H,2,7-9H2,1H3,(H,15,17)(H,16,18)/t12-/m0/s1
n/an/a 2.41E+3n/an/an/an/an/an/a
Italian Institute of Technology
Curated by ChEMBL
Assay Description
Inhibition of human acid ceramidase by UPLC/MS analysis
Eur J Med Chem 111: 138-59 (2016)
BindingDB Entry DOI: 10.7270/Q2GQ70MX
N-acylethanolamine-hydrolyzing acid amidase
(Homo sapiens (Human))
BDBM50151096
(CHEMBL3769689)
Show SMILES CCCOc1ccc(COC(=O)N[C@H]2CNC2=O)cc1 |r|
Show InChI InChI=1S/C14H18N2O4/c1-2-7-19-11-5-3-10(4-6-11)9-20-14(18)16-12-8-15-13(12)17/h3-6,12H,2,7-9H2,1H3,(H,15,17)(H,16,18)/t12-/m0/s1
n/an/a 48n/an/an/an/an/an/a
Italian Institute of Technology
Curated by ChEMBL
Assay Description
Inhibition of recombinant human NAAA expressed in HEK293 cells after 30 mins by UPLC/MS analysis
Eur J Med Chem 111: 138-59 (2016)
BindingDB Entry DOI: 10.7270/Q2GQ70MX