BDBM50151386 CHEMBL3775289
SMILES: OC(=O)c1cc(NCc2ccc(Br)cc2)ccc1O
InChI Key: InChIKey=WZPQXCFICGCMNG-UHFFFAOYSA-N
Data: 1 IC50
Activity Spreadsheet -- Enzyme Inhibition Constant Data from BindingDB
Found 1 hit for monomerid = 50151386
Trg + Lig
Ki
nM
ΔG°
kcal/mole
IC50
nM
Kd
nM
EC50/IC50
nM
koff
s-1
kon
M-1s-1
pHTemp
°C
Lysine-specific demethylase 4C
(Homo sapiens (Human))
BDBM50151386
(CHEMBL3775289)
Show SMILES OC(=O)c1cc(NCc2ccc(Br)cc2)ccc1O
Show InChI InChI=1S/C14H12BrNO3/c15-10-3-1-9(2-4-10)8-16-11-5-6-13(17)12(7-11)14(18)19/h1-7,16-17H,8H2,(H,18,19)
n/an/a 5.20E+3n/an/an/an/an/an/a
University of Oxford
Curated by ChEMBL
Assay Description
Inhibition of N-terminal His6-tagged KDM4C (1 to 352 residues) (unknown origin) expressed in Escherichia coli Rosetta 2(DE3)pLysS using biotinylated ...
J Med Chem 59: 1580-98 (2016)
BindingDB Entry DOI: 10.7270/Q2P84DRX