BDBM50151660 CHEMBL3774630
SMILES: S(Sc1ccns1)c1ccns1
InChI Key: InChIKey=MLRAMCAHIWHWRM-UHFFFAOYSA-N
Data: 5 IC50
Activity Spreadsheet -- Enzyme Inhibition Constant Data from BindingDB
Found 5 hits for monomerid = 50151660
Trg + Lig
Ki
nM
ΔG°
kcal/mole
IC50
nM
Kd
nM
EC50/IC50
nM
koff
s-1
kon
M-1s-1
pHTemp
°C
Histone acetyltransferase KAT5
(Homo sapiens (Human))
BDBM50151660
(CHEMBL3774630)
Show SMILES S(Sc1ccns1)c1ccns1
Show InChI InChI=1S/C6H4N2S4/c1-3-7-9-5(1)11-12-6-2-4-8-10-6/h1-4H
NCI pathway
Reactome pathway
n/an/a 2.00E+3n/an/an/an/an/an/a
University of Freiburg
Curated by ChEMBL
Assay Description
Inhibition of recombinant N-terminal His-tagged TIP60 (unknown origin) expressed in baculovirus-infected insect cell system using histone substrate i...
J Med Chem 59: 1249-70 (2016)
BindingDB Entry DOI: 10.7270/Q2DV1MRN
Histone acetyltransferase p300
(Homo sapiens (Human))
BDBM50151660
(CHEMBL3774630)
Show SMILES S(Sc1ccns1)c1ccns1
Show InChI InChI=1S/C6H4N2S4/c1-3-7-9-5(1)11-12-6-2-4-8-10-6/h1-4H
n/an/a 5.80E+4n/an/an/an/an/an/a
University of Freiburg
Curated by ChEMBL
Assay Description
Inhibition of recombinant GST-tagged p300 (unknown origin) expressed in Escherichia coli cells using histone substrate incubated for 10 mins by radio...
J Med Chem 59: 1249-70 (2016)
BindingDB Entry DOI: 10.7270/Q2DV1MRN
Histone acetyltransferase KAT5
(Homo sapiens (Human))
BDBM50151660
(CHEMBL3774630)
Show SMILES S(Sc1ccns1)c1ccns1
Show InChI InChI=1S/C6H4N2S4/c1-3-7-9-5(1)11-12-6-2-4-8-10-6/h1-4H
NCI pathway
Reactome pathway
n/an/a 2.00E+3n/an/an/an/an/an/a
Sichuan University
Curated by ChEMBL
Assay Description
Displacement of [3H]-acetyl-CoA from recombinant Tip60 (unknown origin) by scintillation counting analysis
Eur J Med Chem 178: 259-286 (2019)
Article DOI: 10.1016/j.ejmech.2019.05.078
Histone acetyltransferase KAT5
(Homo sapiens (Human))
BDBM50151660
(CHEMBL3774630)
Show SMILES S(Sc1ccns1)c1ccns1
Show InChI InChI=1S/C6H4N2S4/c1-3-7-9-5(1)11-12-6-2-4-8-10-6/h1-4H
NCI pathway
Reactome pathway
n/an/a 2.00E+3n/an/an/an/an/an/a
Sichuan University
Curated by ChEMBL
Assay Description
Inhibition of Tip60 (unknown origin) using [3H]-acetyl-CoA as substrate preincubated for 10 mins followed by substrate addition measured after 10 min...
Eur J Med Chem 178: 259-286 (2019)
Article DOI: 10.1016/j.ejmech.2019.05.078
Histone acetyltransferase PCAF
(Homo sapiens (Human))
BDBM50151660
(CHEMBL3774630)
Show SMILES S(Sc1ccns1)c1ccns1
Show InChI InChI=1S/C6H4N2S4/c1-3-7-9-5(1)11-12-6-2-4-8-10-6/h1-4H
NCI pathway
Reactome pathway
n/an/a 3.50E+4n/an/an/an/an/an/a
University of Freiburg
Curated by ChEMBL
Assay Description
Inhibition of recombinant GST-tagged PCAF (unknown origin) expressed in Escherichia coli cells using histone substrate incubated for 10 mins by radio...
J Med Chem 59: 1249-70 (2016)
BindingDB Entry DOI: 10.7270/Q2DV1MRN