BDBM50151857 1-[2-(3-Amino-2-hydroxy-propoxy)-phenyl]-3-phenyl-propan-1-one::CHEMBL1365::N-Depropyl-Propaphenone
SMILES: NCC(O)COc1ccccc1C(=O)CCc1ccccc1
InChI Key: InChIKey=HIGKMVIPYOFHBP-UHFFFAOYSA-N
Data: 1 IC50
Activity Spreadsheet -- Enzyme Inhibition Constant Data from BindingDB
Found 1 hit for monomerid = 50151857
Trg + Lig
Ki
nM
ΔG°
kcal/mole
IC50
nM
Kd
nM
EC50/IC50
nM
koff
s-1
kon
M-1s-1
pHTemp
°C
Potassium voltage-gated channel subfamily H member 2
(Homo sapiens (Human))
BDBM50151857
(1-[2-(3-Amino-2-hydroxy-propoxy)-phenyl]-3-phenyl-...)
Show SMILES NCC(O)COc1ccccc1C(=O)CCc1ccccc1
Show InChI InChI=1S/C18H21NO3/c19-12-15(20)13-22-18-9-5-4-8-16(18)17(21)11-10-14-6-2-1-3-7-14/h1-9,15,20H,10-13,19H2
Reactome pathway
n/an/a 4.40E+4n/an/an/an/an/an/a
China Pharmaceutical University
Curated by ChEMBL
Assay Description
Inhibitory concentration against IKr potassium channel
Bioorg Med Chem Lett 14: 4771-7 (2004)
Article DOI: 10.1016/j.bmcl.2004.06.070
BindingDB Entry DOI: 10.7270/Q208661K