BDBM50151909 3-(3-Pyridin-2-yl-[1,2,4]oxadiazol-5-yl)-benzonitrile::CHEMBL361795
SMILES: N#Cc1cccc(c1)-c1nc(no1)-c1ccccn1
InChI Key: InChIKey=KZOBYFBUONCLFZ-UHFFFAOYSA-N
Data: 1 KI  2 IC50
Activity Spreadsheet -- Enzyme Inhibition Constant Data from BindingDB
Found 3 hits for monomerid = 50151909
Trg + Lig
Ki
nM
ΔG°
kcal/mole
IC50
nM
Kd
nM
EC50/IC50
nM
koff
s-1
kon
M-1s-1
pHTemp
°C
Metabotropic glutamate receptor
(Rattus norvegicus (Rat))
BDBM50151909
(3-(3-Pyridin-2-yl-[1,2,4]oxadiazol-5-yl)-benzonitr...)
Show SMILES N#Cc1cccc(c1)-c1nc(no1)-c1ccccn1
Show InChI InChI=1S/C14H8N4O/c15-9-10-4-3-5-11(8-10)14-17-13(18-19-14)12-6-1-2-7-16-12/h1-8H
Reactome pathway
490n/an/an/an/an/an/an/an/a
TBA
Curated by ChEMBL
Assay Description
Displacement of [3H]-3-methoxy-5-(pyridin-2-ylethynyl)pyridine from glutamate 5 receptor of rat cortical membranes
J Med Chem 47: 4645-8 (2004)
Article DOI: 10.1021/jm049828c
BindingDB Entry DOI: 10.7270/Q2DJ5F3G
Metabotropic glutamate receptor 5
(Homo sapiens (Human))
BDBM50151909
(3-(3-Pyridin-2-yl-[1,2,4]oxadiazol-5-yl)-benzonitr...)
Show SMILES N#Cc1cccc(c1)-c1nc(no1)-c1ccccn1
Show InChI InChI=1S/C14H8N4O/c15-9-10-4-3-5-11(8-10)14-17-13(18-19-14)12-6-1-2-7-16-12/h1-8H
n/an/a 43n/an/an/an/an/an/a
AstraZeneca
Curated by ChEMBL
Assay Description
Negative allosteric modulation of human recombinant mGluR5 expressed in HEK293 cells expressing GLAST assessed as inhibition of DHPG-induced intracel...
Bioorg Med Chem Lett 22: 6974-9 (2012)
Article DOI: 10.1016/j.bmcl.2012.08.100
BindingDB Entry DOI: 10.7270/Q2BP03WH
Metabotropic glutamate receptor 5
(Homo sapiens (Human))
BDBM50151909
(3-(3-Pyridin-2-yl-[1,2,4]oxadiazol-5-yl)-benzonitr...)
Show SMILES N#Cc1cccc(c1)-c1nc(no1)-c1ccccn1
Show InChI InChI=1S/C14H8N4O/c15-9-10-4-3-5-11(8-10)14-17-13(18-19-14)12-6-1-2-7-16-12/h1-8H
n/an/a 100n/an/an/an/an/an/a
TBA
Curated by ChEMBL
Assay Description
Inhibitory concentration towards human glutamate receptor 5 in calcium flux assay
J Med Chem 47: 4645-8 (2004)
Article DOI: 10.1021/jm049828c
BindingDB Entry DOI: 10.7270/Q2DJ5F3G