BDBM50151966 3-{4-[4-(4-Hydroxy-phenyl)-piperazin-1-yl]-butyl}-1H-indole-5-carboxylic acid amide::CHEMBL439664
SMILES: NC(=O)c1ccc2[nH]cc(CCCCN3CCN(CC3)c3ccc(O)cc3)c2c1
InChI Key: InChIKey=VXYWRBIWAVBFCQ-UHFFFAOYSA-N
Data: 2 IC50
Activity Spreadsheet -- Enzyme Inhibition Constant Data from BindingDB
Found 2 hits for monomerid = 50151966
Trg + Lig
Ki
nM
ΔG°
kcal/mole
IC50
nM
Kd
nM
EC50/IC50
nM
koff
s-1
kon
M-1s-1
pHTemp
°C
5-hydroxytryptamine receptor 1A
(Rattus norvegicus (rat))
BDBM50151966
(3-{4-[4-(4-Hydroxy-phenyl)-piperazin-1-yl]-butyl}-...)
Show SMILES NC(=O)c1ccc2[nH]cc(CCCCN3CCN(CC3)c3ccc(O)cc3)c2c1
Show InChI InChI=1S/C23H28N4O2/c24-23(29)17-4-9-22-21(15-17)18(16-25-22)3-1-2-10-26-11-13-27(14-12-26)19-5-7-20(28)8-6-19/h4-9,15-16,25,28H,1-3,10-14H2,(H2,24,29)
n/an/a 0.200n/an/an/an/an/an/a
Merck KGaA
Curated by ChEMBL
Assay Description
Inhibition of 8-OH DPAT bindign to rat hydroxytryptamine 1A receptor expressed in CHO cells
J Med Chem 47: 4677-83 (2004)
Article DOI: 10.1021/jm040792y
BindingDB Entry DOI: 10.7270/Q28S4PCR
D(2) dopamine receptor
(Rattus norvegicus (rat))
BDBM50151966
(3-{4-[4-(4-Hydroxy-phenyl)-piperazin-1-yl]-butyl}-...)
Show SMILES NC(=O)c1ccc2[nH]cc(CCCCN3CCN(CC3)c3ccc(O)cc3)c2c1
Show InChI InChI=1S/C23H28N4O2/c24-23(29)17-4-9-22-21(15-17)18(16-25-22)3-1-2-10-26-11-13-27(14-12-26)19-5-7-20(28)8-6-19/h4-9,15-16,25,28H,1-3,10-14H2,(H2,24,29)
Reactome pathway
n/an/a 156n/an/an/an/an/an/a
Merck KGaA
Curated by ChEMBL
Assay Description
Displacement of [3H]-spiperone from dopamine D2 receptor of rat striatal membranes
J Med Chem 47: 4677-83 (2004)
Article DOI: 10.1021/jm040792y
BindingDB Entry DOI: 10.7270/Q28S4PCR