BDBM50151978 3-[4-(4-Phenyl-piperidin-1-yl)-butyl]-1H-indole-5-carboxylic acid amide::CHEMBL188625
SMILES: NC(=O)c1ccc2[nH]cc(CCCCN3CCC(CC3)c3ccccc3)c2c1
InChI Key: InChIKey=RBDWWKPSSYIBCB-UHFFFAOYSA-N
Data: 2 IC50
Activity Spreadsheet -- Enzyme Inhibition Constant Data from BindingDB
Found 2 hits for monomerid = 50151978
Trg + Lig
Ki
nM
ΔG°
kcal/mole
IC50
nM
Kd
nM
EC50/IC50
nM
koff
s-1
kon
M-1s-1
pHTemp
°C
5-hydroxytryptamine receptor 1A
(Rattus norvegicus (rat))
BDBM50151978
(3-[4-(4-Phenyl-piperidin-1-yl)-butyl]-1H-indole-5-...)
Show SMILES NC(=O)c1ccc2[nH]cc(CCCCN3CCC(CC3)c3ccccc3)c2c1
Show InChI InChI=1S/C24H29N3O/c25-24(28)20-9-10-23-22(16-20)21(17-26-23)8-4-5-13-27-14-11-19(12-15-27)18-6-2-1-3-7-18/h1-3,6-7,9-10,16-17,19,26H,4-5,8,11-15H2,(H2,25,28)
n/an/a 0.100n/an/an/an/an/an/a
Merck KGaA
Curated by ChEMBL
Assay Description
Inhibition of 8-OH DPAT bindign to rat hydroxytryptamine 1A receptor expressed in CHO cells
J Med Chem 47: 4677-83 (2004)
Article DOI: 10.1021/jm040792y
BindingDB Entry DOI: 10.7270/Q28S4PCR
D(2) dopamine receptor
(Rattus norvegicus (rat))
BDBM50151978
(3-[4-(4-Phenyl-piperidin-1-yl)-butyl]-1H-indole-5-...)
Show SMILES NC(=O)c1ccc2[nH]cc(CCCCN3CCC(CC3)c3ccccc3)c2c1
Show InChI InChI=1S/C24H29N3O/c25-24(28)20-9-10-23-22(16-20)21(17-26-23)8-4-5-13-27-14-11-19(12-15-27)18-6-2-1-3-7-18/h1-3,6-7,9-10,16-17,19,26H,4-5,8,11-15H2,(H2,25,28)
Reactome pathway
n/an/a 17n/an/an/an/an/an/a
Merck KGaA
Curated by ChEMBL
Assay Description
Displacement of [3H]-spiperone from dopamine D2 receptor of rat striatal membranes
J Med Chem 47: 4677-83 (2004)
Article DOI: 10.1021/jm040792y
BindingDB Entry DOI: 10.7270/Q28S4PCR