BDBM50152068 CHEMBL3781485
SMILES: CSCC[C@H](NC(=O)[C@@H]1CCCCNC(=O)CCC(=O)NCCCC[C@H](NC(C)=O)C(=O)N[C@@H](CCCCN)C(=O)N[C@@H](CCCCNC(C)=S)C(=O)N1)C(N)=O
InChI Key: InChIKey=OWKCFFYUTGURHW-IIZANFQQSA-N
Data: 3 IC50
Activity Spreadsheet -- Enzyme Inhibition Constant Data from BindingDB
Found 3 hits for monomerid = 50152068
Trg + Lig
Ki
nM
ΔG°
kcal/mole
IC50
nM
Kd
nM
EC50/IC50
nM
koff
s-1
kon
M-1s-1
pHTemp
°C
NAD-Dependent Deacetylase Sirtuin-1
(Homo sapiens (Human))
BDBM50152068
(CHEMBL3781485)
Show SMILES CSCC[C@H](NC(=O)[C@@H]1CCCCNC(=O)CCC(=O)NCCCC[C@H](NC(C)=O)C(=O)N[C@@H](CCCCN)C(=O)N[C@@H](CCCCNC(C)=S)C(=O)N1)C(N)=O |r|
Show InChI InChI=1S/C37H66N10O8S2/c1-24(48)43-27-13-6-10-21-41-31(49)16-17-32(50)42-22-11-7-15-29(35(53)44-26(33(39)51)18-23-57-3)46-37(55)30(14-5-9-20-40-25(2)56)47-36(54)28(45-34(27)52)12-4-8-19-38/h26-30H,4-23,38H2,1-3H3,(H2,39,51)(H,40,56)(H,41,49)(H,42,50)(H,43,48)(H,44,53)(H,45,52)(H,46,55)(H,47,54)/t26-,27-,28-,29-,30-/m0/s1
NCI pathway
Reactome pathway
n/an/a 75n/an/an/an/an/an/a
Jiangsu University
Curated by ChEMBL
Assay Description
Inhibition of recombinant GST-tagged human SIRT1 using 0.3 mM H2N-HK-[N(epsilon)-acetyl-lysine]-LM-COOH as substrate measured after 10 mins HPLC anal...
Bioorg Med Chem Lett 26: 1612-7 (2016)
BindingDB Entry DOI: 10.7270/Q2HM5B9J
NAD-dependent protein deacetylase sirtuin-3 (SIRT3)
(Homo sapiens (Human))
BDBM50152068
(CHEMBL3781485)
Show SMILES CSCC[C@H](NC(=O)[C@@H]1CCCCNC(=O)CCC(=O)NCCCC[C@H](NC(C)=O)C(=O)N[C@@H](CCCCN)C(=O)N[C@@H](CCCCNC(C)=S)C(=O)N1)C(N)=O |r|
Show InChI InChI=1S/C37H66N10O8S2/c1-24(48)43-27-13-6-10-21-41-31(49)16-17-32(50)42-22-11-7-15-29(35(53)44-26(33(39)51)18-23-57-3)46-37(55)30(14-5-9-20-40-25(2)56)47-36(54)28(45-34(27)52)12-4-8-19-38/h26-30H,4-23,38H2,1-3H3,(H2,39,51)(H,40,56)(H,41,49)(H,42,50)(H,43,48)(H,44,53)(H,45,52)(H,46,55)(H,47,54)/t26-,27-,28-,29-,30-/m0/s1
n/an/a 83n/an/an/an/an/an/a
Jiangsu University
Curated by ChEMBL
Assay Description
Inhibition of recombinant His6 tagged human SIRT3 using 0.105 mM H2N-HK-[N(epsilon)-acetyl-lysine]-LM-COOH as substrate measured after 10 mins HPLC a...
Bioorg Med Chem Lett 26: 1612-7 (2016)
BindingDB Entry DOI: 10.7270/Q2HM5B9J
NAD-dependent deacetylase sirtuin 2
(Homo sapiens (Human))
BDBM50152068
(CHEMBL3781485)
Show SMILES CSCC[C@H](NC(=O)[C@@H]1CCCCNC(=O)CCC(=O)NCCCC[C@H](NC(C)=O)C(=O)N[C@@H](CCCCN)C(=O)N[C@@H](CCCCNC(C)=S)C(=O)N1)C(N)=O |r|
Show InChI InChI=1S/C37H66N10O8S2/c1-24(48)43-27-13-6-10-21-41-31(49)16-17-32(50)42-22-11-7-15-29(35(53)44-26(33(39)51)18-23-57-3)46-37(55)30(14-5-9-20-40-25(2)56)47-36(54)28(45-34(27)52)12-4-8-19-38/h26-30H,4-23,38H2,1-3H3,(H2,39,51)(H,40,56)(H,41,49)(H,42,50)(H,43,48)(H,44,53)(H,45,52)(H,46,55)(H,47,54)/t26-,27-,28-,29-,30-/m0/s1
NCI pathway
n/an/a 10n/an/an/an/an/an/a
Jiangsu University
Curated by ChEMBL
Assay Description
Inhibition of recombinant His6 tagged human SIRT2 using 0.39 mM H2N-HK-[N(epsilon)-acetyl-lysine]-LM-COOH as substrate measured after 12 mins HPLC an...
Bioorg Med Chem Lett 26: 1612-7 (2016)
BindingDB Entry DOI: 10.7270/Q2HM5B9J