BDBM50152134 CHEMBL3781662
SMILES: COCC(C)(C)CNc1ccnc(N)n1
InChI Key: InChIKey=RHMMTAQFZXVDKY-UHFFFAOYSA-N
Data: 1 IC50
Activity Spreadsheet -- Enzyme Inhibition Constant Data from BindingDB
Found 1 hit for monomerid = 50152134
Trg + Lig
Ki
nM
ΔG°
kcal/mole
IC50
nM
Kd
nM
EC50/IC50
nM
koff
s-1
kon
M-1s-1
pHTemp
°C
MutT homolog 1 protein (MTH1)
(Homo sapiens (Human))
BDBM50152134
(CHEMBL3781662)
Show SMILES COCC(C)(C)CNc1ccnc(N)n1
Show InChI InChI=1S/C10H18N4O/c1-10(2,7-15-3)6-13-8-4-5-12-9(11)14-8/h4-5H,6-7H2,1-3H3,(H3,11,12,13,14)
n/an/a 120n/an/an/an/an/an/a
MD Anderson Cancer Center
Curated by ChEMBL
Assay Description
Inhibition of recombinant MTH1 (unknown origin) assessed as hydrolysis of 8-oxodGTP to 8-oxodGMP and pyrophosphate by PPiLight assay
Bioorg Med Chem Lett 26: 1503-7 (2016)
BindingDB Entry DOI: 10.7270/Q20K2BF6