BDBM50152359 4-[6-Methoxy-7-(2-piperidin-1-yl-ethoxy)-quinazolin-4-yl]-piperazine-1-carbothioic acid (pyridin-2-ylmethyl)-amide::CHEMBL363723
SMILES: COc1cc2c(ncnc2cc1OCCN1CCCCC1)N1CCN(CC1)C(=S)NCc1ccccn1
InChI Key: InChIKey=JXXLJDZKYNEXDA-UHFFFAOYSA-N
Data: 1 IC50
Activity Spreadsheet -- Enzyme Inhibition Constant Data from BindingDB
Found 1 hit for monomerid = 50152359
Trg + Lig
Ki
nM
ΔG°
kcal/mole
IC50
nM
Kd
nM
EC50/IC50
nM
koff
s-1
kon
M-1s-1
pHTemp
°C
Platelet-derived growth factor receptor beta
(Homo sapiens (Human))
BDBM50152359
(4-[6-Methoxy-7-(2-piperidin-1-yl-ethoxy)-quinazoli...)
Show SMILES COc1cc2c(ncnc2cc1OCCN1CCCCC1)N1CCN(CC1)C(=S)NCc1ccccn1
Show InChI InChI=1S/C27H35N7O2S/c1-35-24-17-22-23(18-25(24)36-16-15-32-9-5-2-6-10-32)30-20-31-26(22)33-11-13-34(14-12-33)27(37)29-19-21-7-3-4-8-28-21/h3-4,7-8,17-18,20H,2,5-6,9-16,19H2,1H3,(H,29,37)
NCI pathway
Reactome pathway
n/an/a 4.09E+3n/an/an/an/an/an/a
and In Vivo Sciences Millennium Pharmaceuticals, Inc.
Curated by ChEMBL
Assay Description
In vitro inhibition of Platelet derived growth factor receptor beta autophosphorylation in MG-63 cells without plasma
Bioorg Med Chem Lett 14: 4867-72 (2004)
Article DOI: 10.1016/j.bmcl.2004.07.041
BindingDB Entry DOI: 10.7270/Q2VM4BQN