null
SMILES: COc1cc2c(ncnc2cc1OCCN1CCCC1)N1CCN(CC1)C(=S)Nc1ccc(cc1)C#N
InChI Key: InChIKey=AQJAPASXXFSRQU-UHFFFAOYSA-N
Activity Spreadsheet -- Enzyme Inhibition Constant Data from BindingDB
Found 2 hits for monomerid = 50152360
Trg + Lig
Ki
nM
ΔG°
kcal/mole
IC50
nM
Kd
nM
EC50/IC50
nM
koff
s-1
kon
M-1s-1
pHTemp
°C
Platelet-derived growth factor receptor beta
(Homo sapiens (Human))
BDBM50152360
(4-[6-Methoxy-7-(2-pyrrolidin-1-yl-ethoxy)-quinazol...)
Show SMILES COc1cc2c(ncnc2cc1OCCN1CCCC1)N1CCN(CC1)C(=S)Nc1ccc(cc1)C#N
Show InChI InChI=1S/C27H31N7O2S/c1-35-24-16-22-23(17-25(24)36-15-14-32-8-2-3-9-32)29-19-30-26(22)33-10-12-34(13-11-33)27(37)31-21-6-4-20(18-28)5-7-21/h4-7,16-17,19H,2-3,8-15H2,1H3,(H,31,37)
NCI pathway
Reactome pathway
n/an/a 460n/an/an/an/an/an/a
and In Vivo Sciences Millennium Pharmaceuticals, Inc.
Curated by ChEMBL
Assay Description
In vitro inhibition of Platelet derived growth factor receptor beta autophosphorylation in MG-63 cells without plasma
Bioorg Med Chem Lett 14: 4867-72 (2004)
Article DOI: 10.1016/j.bmcl.2004.07.041
BindingDB Entry DOI: 10.7270/Q2VM4BQN
Platelet-derived growth factor receptor beta
(Homo sapiens (Human))
BDBM50152360
(4-[6-Methoxy-7-(2-pyrrolidin-1-yl-ethoxy)-quinazol...)
Show SMILES COc1cc2c(ncnc2cc1OCCN1CCCC1)N1CCN(CC1)C(=S)Nc1ccc(cc1)C#N
Show InChI InChI=1S/C27H31N7O2S/c1-35-24-16-22-23(17-25(24)36-15-14-32-8-2-3-9-32)29-19-30-26(22)33-10-12-34(13-11-33)27(37)31-21-6-4-20(18-28)5-7-21/h4-7,16-17,19H,2-3,8-15H2,1H3,(H,31,37)
NCI pathway
Reactome pathway
n/an/a 2.16E+4n/an/an/an/an/an/a
and In Vivo Sciences Millennium Pharmaceuticals, Inc.
Curated by ChEMBL
Assay Description
In vitro inhibition of Platelet derived growth factor receptor beta autophosphorylation in MG-63 cells with 45% human plasma
Bioorg Med Chem Lett 14: 4867-72 (2004)
Article DOI: 10.1016/j.bmcl.2004.07.041
BindingDB Entry DOI: 10.7270/Q2VM4BQN