BDBM50152386 4-[6-Methoxy-7-(3-piperidin-1-yl-propoxy)-quinazolin-4-yl]-piperazine-1-carbothioic acid (pyridin-4-ylmethyl)-amide::CHEMBL185605
SMILES: COc1cc2c(ncnc2cc1OCCCN1CCCCC1)N1CCN(CC1)C(=S)NCc1ccncc1
InChI Key: InChIKey=AZWMTFYZTWXQRL-UHFFFAOYSA-N
Data: 2 IC50
Activity Spreadsheet -- Enzyme Inhibition Constant Data from BindingDB
Found 2 hits for monomerid = 50152386
Trg + Lig
Ki
nM
ΔG°
kcal/mole
IC50
nM
Kd
nM
EC50/IC50
nM
koff
s-1
kon
M-1s-1
pHTemp
°C
Platelet-derived growth factor receptor beta
(Homo sapiens (Human))
BDBM50152386
(4-[6-Methoxy-7-(3-piperidin-1-yl-propoxy)-quinazol...)
Show SMILES COc1cc2c(ncnc2cc1OCCCN1CCCCC1)N1CCN(CC1)C(=S)NCc1ccncc1
Show InChI InChI=1S/C28H37N7O2S/c1-36-25-18-23-24(19-26(25)37-17-5-12-33-10-3-2-4-11-33)31-21-32-27(23)34-13-15-35(16-14-34)28(38)30-20-22-6-8-29-9-7-22/h6-9,18-19,21H,2-5,10-17,20H2,1H3,(H,30,38)
NCI pathway
Reactome pathway
n/an/a 2.45E+3n/an/an/an/an/an/a
and In Vivo Sciences Millennium Pharmaceuticals, Inc.
Curated by ChEMBL
Assay Description
In vitro inhibition of Platelet derived growth factor receptor beta autophosphorylation in MG-63 cells with 45% human plasma
Bioorg Med Chem Lett 14: 4867-72 (2004)
Article DOI: 10.1016/j.bmcl.2004.07.041
BindingDB Entry DOI: 10.7270/Q2VM4BQN
Platelet-derived growth factor receptor beta
(Homo sapiens (Human))
BDBM50152386
(4-[6-Methoxy-7-(3-piperidin-1-yl-propoxy)-quinazol...)
Show SMILES COc1cc2c(ncnc2cc1OCCCN1CCCCC1)N1CCN(CC1)C(=S)NCc1ccncc1
Show InChI InChI=1S/C28H37N7O2S/c1-36-25-18-23-24(19-26(25)37-17-5-12-33-10-3-2-4-11-33)31-21-32-27(23)34-13-15-35(16-14-34)28(38)30-20-22-6-8-29-9-7-22/h6-9,18-19,21H,2-5,10-17,20H2,1H3,(H,30,38)
NCI pathway
Reactome pathway
n/an/a 1.34E+4n/an/an/an/an/an/a
and In Vivo Sciences Millennium Pharmaceuticals, Inc.
Curated by ChEMBL
Assay Description
In vitro inhibition of Platelet derived growth factor receptor beta autophosphorylation in MG-63 cells without plasma
Bioorg Med Chem Lett 14: 4867-72 (2004)
Article DOI: 10.1016/j.bmcl.2004.07.041
BindingDB Entry DOI: 10.7270/Q2VM4BQN