BDBM50152388 4-[4-(N-Substituted-thio-carbamoyl)-1-piperazinyl]-6-methoxy-7-alkoxyamino-quinazoline derivative::CHEMBL184906
SMILES: COc1cc2c(ncnc2cc1OCCCN1CCCCC1)N1CCN(CC1)C(NCc1ccc(nc1)C(F)(F)F)=NC#N
InChI Key: InChIKey=LITPNQNRXSIYEU-UHFFFAOYSA-N
Data: 2 IC50
Activity Spreadsheet -- Enzyme Inhibition Constant Data from BindingDB
Found 2 hits for monomerid = 50152388
Trg + Lig
Ki
nM
ΔG°
kcal/mole
IC50
nM
Kd
nM
EC50/IC50
nM
koff
s-1
kon
M-1s-1
pHTemp
°C
Platelet-derived growth factor receptor beta
(Homo sapiens (Human))
BDBM50152388
(4-[4-(N-Substituted-thio-carbamoyl)-1-piperazinyl]...)
Show SMILES COc1cc2c(ncnc2cc1OCCCN1CCCCC1)N1CCN(CC1)C(NCc1ccc(nc1)C(F)(F)F)=NC#N |w:41.46|
Show InChI InChI=1S/C30H36F3N9O2/c1-43-25-16-23-24(17-26(25)44-15-5-10-40-8-3-2-4-9-40)38-21-39-28(23)41-11-13-42(14-12-41)29(37-20-34)36-19-22-6-7-27(35-18-22)30(31,32)33/h6-7,16-18,21H,2-5,8-15,19H2,1H3,(H,36,37)
NCI pathway
Reactome pathway
n/an/a 3.42E+3n/an/an/an/an/an/a
and In Vivo Sciences Millennium Pharmaceuticals, Inc.
Curated by ChEMBL
Assay Description
In vitro inhibition of Platelet derived growth factor receptor beta autophosphorylation in MG-63 cells without plasma
Bioorg Med Chem Lett 14: 4867-72 (2004)
Article DOI: 10.1016/j.bmcl.2004.07.041
BindingDB Entry DOI: 10.7270/Q2VM4BQN
Platelet-derived growth factor receptor beta
(Homo sapiens (Human))
BDBM50152388
(4-[4-(N-Substituted-thio-carbamoyl)-1-piperazinyl]...)
Show SMILES COc1cc2c(ncnc2cc1OCCCN1CCCCC1)N1CCN(CC1)C(NCc1ccc(nc1)C(F)(F)F)=NC#N |w:41.46|
Show InChI InChI=1S/C30H36F3N9O2/c1-43-25-16-23-24(17-26(25)44-15-5-10-40-8-3-2-4-9-40)38-21-39-28(23)41-11-13-42(14-12-41)29(37-20-34)36-19-22-6-7-27(35-18-22)30(31,32)33/h6-7,16-18,21H,2-5,8-15,19H2,1H3,(H,36,37)
NCI pathway
Reactome pathway
n/an/a 2.18E+3n/an/an/an/an/an/a
and In Vivo Sciences Millennium Pharmaceuticals, Inc.
Curated by ChEMBL
Assay Description
In vitro inhibition of Platelet derived growth factor receptor beta autophosphorylation in MG-63 cells with 45% human plasma
Bioorg Med Chem Lett 14: 4867-72 (2004)
Article DOI: 10.1016/j.bmcl.2004.07.041
BindingDB Entry DOI: 10.7270/Q2VM4BQN