null
SMILES: COc1cc2c(ncnc2cc1OCCN1CCCCC1)N1CCN(CC1)C(=S)Nc1cccnc1
InChI Key: InChIKey=VVVVOEUKMSUAAI-UHFFFAOYSA-N
Activity Spreadsheet -- Enzyme Inhibition Constant Data from BindingDB
Found 2 hits for monomerid = 50152392
Trg + Lig
Ki
nM
ΔG°
kcal/mole
IC50
nM
Kd
nM
EC50/IC50
nM
koff
s-1
kon
M-1s-1
pHTemp
°C
Platelet-derived growth factor receptor beta
(Homo sapiens (Human))
BDBM50152392
(4-[6-Methoxy-7-(2-piperidin-1-yl-ethoxy)-quinazoli...)
Show SMILES COc1cc2c(ncnc2cc1OCCN1CCCCC1)N1CCN(CC1)C(=S)Nc1cccnc1
Show InChI InChI=1S/C26H33N7O2S/c1-34-23-16-21-22(17-24(23)35-15-14-31-8-3-2-4-9-31)28-19-29-25(21)32-10-12-33(13-11-32)26(36)30-20-6-5-7-27-18-20/h5-7,16-19H,2-4,8-15H2,1H3,(H,30,36)
NCI pathway
Reactome pathway
n/an/a 4.98E+3n/an/an/an/an/an/a
and In Vivo Sciences Millennium Pharmaceuticals, Inc.
Curated by ChEMBL
Assay Description
In vitro inhibition of Platelet derived growth factor receptor beta autophosphorylation in MG-63 cells with 45% human plasma
Bioorg Med Chem Lett 14: 4867-72 (2004)
Article DOI: 10.1016/j.bmcl.2004.07.041
BindingDB Entry DOI: 10.7270/Q2VM4BQN
Platelet-derived growth factor receptor beta
(Homo sapiens (Human))
BDBM50152392
(4-[6-Methoxy-7-(2-piperidin-1-yl-ethoxy)-quinazoli...)
Show SMILES COc1cc2c(ncnc2cc1OCCN1CCCCC1)N1CCN(CC1)C(=S)Nc1cccnc1
Show InChI InChI=1S/C26H33N7O2S/c1-34-23-16-21-22(17-24(23)35-15-14-31-8-3-2-4-9-31)28-19-29-25(21)32-10-12-33(13-11-32)26(36)30-20-6-5-7-27-18-20/h5-7,16-19H,2-4,8-15H2,1H3,(H,30,36)
NCI pathway
Reactome pathway
n/an/a 3.76E+3n/an/an/an/an/an/a
and In Vivo Sciences Millennium Pharmaceuticals, Inc.
Curated by ChEMBL
Assay Description
In vitro inhibition of Platelet derived growth factor receptor beta autophosphorylation in MG-63 cells without plasma
Bioorg Med Chem Lett 14: 4867-72 (2004)
Article DOI: 10.1016/j.bmcl.2004.07.041
BindingDB Entry DOI: 10.7270/Q2VM4BQN