BDBM50152562 4-(3,4''-Dichloro-biphenyl-4-yl)-2,4-dioxo-butyric acid::CHEMBL183257
SMILES: OC(=O)C(=O)CC(=O)c1ccc(cc1Cl)-c1ccc(Cl)cc1
InChI Key: InChIKey=XHURXRSUVMLPLE-UHFFFAOYSA-N
Data: 2 IC50
Activity Spreadsheet -- Enzyme Inhibition Constant Data from BindingDB
Found 2 hits for monomerid = 50152562
Trg + Lig
Ki
nM
ΔG°
kcal/mole
IC50
nM
Kd
nM
EC50/IC50
nM
koff
s-1
kon
M-1s-1
pHTemp
°C
Flap endonuclease 1
(Homo sapiens (Human))
BDBM50152562
(4-(3,4''-Dichloro-biphenyl-4-yl)-2,4-dioxo-butyric...)
Show SMILES OC(=O)C(=O)CC(=O)c1ccc(cc1Cl)-c1ccc(Cl)cc1
Show InChI InChI=1S/C16H10Cl2O4/c17-11-4-1-9(2-5-11)10-3-6-12(13(18)7-10)14(19)8-15(20)16(21)22/h1-7H,8H2,(H,21,22)
Reactome pathway
n/an/a 410n/an/an/an/an/an/a
Athersys, Inc.
Curated by ChEMBL
Assay Description
Concentration required for 50% inhibition of Flap endonuclease-1
Bioorg Med Chem Lett 14: 4915-8 (2004)
Article DOI: 10.1016/j.bmcl.2004.07.028
BindingDB Entry DOI: 10.7270/Q2ZC82BF
DNA excision repair protein ERCC-5
(Homo sapiens (Human))
BDBM50152562
(4-(3,4''-Dichloro-biphenyl-4-yl)-2,4-dioxo-butyric...)
Show SMILES OC(=O)C(=O)CC(=O)c1ccc(cc1Cl)-c1ccc(Cl)cc1
Show InChI InChI=1S/C16H10Cl2O4/c17-11-4-1-9(2-5-11)10-3-6-12(13(18)7-10)14(19)8-15(20)16(21)22/h1-7H,8H2,(H,21,22)
Reactome pathway
n/an/a 1.77E+3n/an/an/an/an/an/a
Athersys, Inc.
Curated by ChEMBL
Assay Description
Concentration required for 50% inhibition of Xeroderma pigmentosum G
Bioorg Med Chem Lett 14: 4915-8 (2004)
Article DOI: 10.1016/j.bmcl.2004.07.028
BindingDB Entry DOI: 10.7270/Q2ZC82BF