null
SMILES: Oc1ccc(cc1)-c1cc2cc(O)cc(Cl)c2o1
InChI Key: InChIKey=OCILFYQUCSGLEE-UHFFFAOYSA-N
Activity Spreadsheet -- Enzyme Inhibition Constant Data from BindingDB
Found 2 hits for monomerid = 50152626
Trg + Lig
Ki
nM
ΔG°
kcal/mole
IC50
nM
Kd
nM
EC50/IC50
nM
koff
s-1
kon
M-1s-1
pHTemp
°C
Estrogen receptor beta
(Homo sapiens (Human))
BDBM50152626
(7-Chloro-2-(4-hydroxy-phenyl)-benzofuran-5-ol | CH...)
Show SMILES Oc1ccc(cc1)-c1cc2cc(O)cc(Cl)c2o1
Show InChI InChI=1S/C14H9ClO3/c15-12-7-11(17)5-9-6-13(18-14(9)12)8-1-3-10(16)4-2-8/h1-7,16-17H
n/an/a 1.60n/an/an/an/an/an/a
Wyeth Research
Curated by ChEMBL
Assay Description
Binding affinity for human Estrogen receptor beta
Bioorg Med Chem Lett 14: 4925-9 (2004)
Article DOI: 10.1016/j.bmcl.2004.07.029
BindingDB Entry DOI: 10.7270/Q2TM79K8
Estrogen receptor
(Homo sapiens (Human))
BDBM50152626
(7-Chloro-2-(4-hydroxy-phenyl)-benzofuran-5-ol | CH...)
Show SMILES Oc1ccc(cc1)-c1cc2cc(O)cc(Cl)c2o1
Show InChI InChI=1S/C14H9ClO3/c15-12-7-11(17)5-9-6-13(18-14(9)12)8-1-3-10(16)4-2-8/h1-7,16-17H
n/an/a 6.80n/an/an/an/an/an/a
Wyeth Research
Curated by ChEMBL
Assay Description
Binding affinity for human Estrogen receptor alpha
Bioorg Med Chem Lett 14: 4925-9 (2004)
Article DOI: 10.1016/j.bmcl.2004.07.029
BindingDB Entry DOI: 10.7270/Q2TM79K8