null
SMILES: NC(=O)c1c(Cl)ccc(NC(=O)Nc2ccccc2Br)c1O
InChI Key: InChIKey=HXWAIGPPSSSOED-UHFFFAOYSA-N
Activity Spreadsheet -- Enzyme Inhibition Constant Data from BindingDB
Found 2 hits for monomerid = 50152759
Trg + Lig
Ki
nM
ΔG°
kcal/mole
IC50
nM
Kd
nM
EC50/IC50
nM
koff
s-1
kon
M-1s-1
pHTemp
°C
C-X-C chemokine receptor type 1
(Homo sapiens (Human))
BDBM50152759
(3-[3-(2-Bromo-phenyl)-ureido]-6-chloro-2-hydroxy-b...)
Show SMILES NC(=O)c1c(Cl)ccc(NC(=O)Nc2ccccc2Br)c1O
Show InChI InChI=1S/C14H11BrClN3O3/c15-7-3-1-2-4-9(7)18-14(22)19-10-6-5-8(16)11(12(10)20)13(17)21/h1-6,20H,(H2,17,21)(H2,18,19,22)
n/an/a 6.04E+3n/an/an/an/an/an/a
GlaxoSmithKline
Curated by ChEMBL
Assay Description
Concentration required to inhibit [125I]-IL-8 binding towards C-X-C chemokine receptor type 1 of human expressed in CHO cells
Bioorg Med Chem Lett 14: 4375-8 (2004)
Article DOI: 10.1016/j.bmcl.2004.06.097
BindingDB Entry DOI: 10.7270/Q2SQ914M
C-X-C chemokine receptor type 2
(Homo sapiens (Human))
BDBM50152759
(3-[3-(2-Bromo-phenyl)-ureido]-6-chloro-2-hydroxy-b...)
Show SMILES NC(=O)c1c(Cl)ccc(NC(=O)Nc2ccccc2Br)c1O
Show InChI InChI=1S/C14H11BrClN3O3/c15-7-3-1-2-4-9(7)18-14(22)19-10-6-5-8(16)11(12(10)20)13(17)21/h1-6,20H,(H2,17,21)(H2,18,19,22)
Reactome pathway
n/an/a 10n/an/an/an/an/an/a
GlaxoSmithKline
Curated by ChEMBL
Assay Description
Concentration required to inhibit [125I]IL-8 binding towards C-X-C chemokine receptor type 2 of human expressed in CHO cells
Bioorg Med Chem Lett 14: 4375-8 (2004)
Article DOI: 10.1016/j.bmcl.2004.06.097
BindingDB Entry DOI: 10.7270/Q2SQ914M