null
SMILES: CN(C)S(=O)(=O)c1c(Cl)ccc(NC(=O)Nc2ccccc2Br)c1O
InChI Key: InChIKey=VFIHSHQEJFZETC-UHFFFAOYSA-N
Activity Spreadsheet -- Enzyme Inhibition Constant Data from BindingDB
Found 2 hits for monomerid = 50152760
Trg + Lig
Ki
nM
ΔG°
kcal/mole
IC50
nM
Kd
nM
EC50/IC50
nM
koff
s-1
kon
M-1s-1
pHTemp
°C
C-X-C chemokine receptor type 2
(Homo sapiens (Human))
BDBM50152760
(3-[3-(2-Bromo-phenyl)-ureido]-6-chloro-2-hydroxy-N...)
Show SMILES CN(C)S(=O)(=O)c1c(Cl)ccc(NC(=O)Nc2ccccc2Br)c1O
Show InChI InChI=1S/C15H15BrClN3O4S/c1-20(2)25(23,24)14-10(17)7-8-12(13(14)21)19-15(22)18-11-6-4-3-5-9(11)16/h3-8,21H,1-2H3,(H2,18,19,22)
Reactome pathway
n/an/a 12n/an/an/an/an/an/a
GlaxoSmithKline
Curated by ChEMBL
Assay Description
Concentration required to inhibit [125I]IL-8 binding towards C-X-C chemokine receptor type 2 of human expressed in CHO cells
Bioorg Med Chem Lett 14: 4375-8 (2004)
Article DOI: 10.1016/j.bmcl.2004.06.097
BindingDB Entry DOI: 10.7270/Q2SQ914M
C-X-C chemokine receptor type 1
(Homo sapiens (Human))
BDBM50152760
(3-[3-(2-Bromo-phenyl)-ureido]-6-chloro-2-hydroxy-N...)
Show SMILES CN(C)S(=O)(=O)c1c(Cl)ccc(NC(=O)Nc2ccccc2Br)c1O
Show InChI InChI=1S/C15H15BrClN3O4S/c1-20(2)25(23,24)14-10(17)7-8-12(13(14)21)19-15(22)18-11-6-4-3-5-9(11)16/h3-8,21H,1-2H3,(H2,18,19,22)
n/an/a 4.32E+3n/an/an/an/an/an/a
GlaxoSmithKline
Curated by ChEMBL
Assay Description
Concentration required to inhibit [125I]-IL-8 binding towards C-X-C chemokine receptor type 1 of human expressed in CHO cells
Bioorg Med Chem Lett 14: 4375-8 (2004)
Article DOI: 10.1016/j.bmcl.2004.06.097
BindingDB Entry DOI: 10.7270/Q2SQ914M